program: Gaussian 09
title: 000261973
version: EM64L-G09RevD.01
frameworkgroup: C1[X(C16H26N2O4)]
method: RPBEPBE
basis: SDD
operation: Freq
keyword: #p
keyword: freq=noraman
keyword: PBEPBE/SDD
title: #p freq=noraman PBEPBE/SDD
converged: YES YES NO NO
title: Mulliken charges:
elementType: O O O O N N C C C C C C C C C C C C C C C C H H H H H H H H H H H H H H H H H H H H H H H H H H
charge: -0.301495 -0.301489 -0.289021 -0.288998 -0.378521 -0.378527 -0.331420 -0.331405 -0.401748 -0.401764 0.228538 0.228548 -0.339977 -0.339976 0.084548 0.084535 -0.027530 -0.027607 -0.687823 -0.687824 -0.521350 -0.521345 0.210554 0.258289 0.210556 0.258281 0.196233 0.213905 0.196241 0.213901 0.347324 0.347327 0.195154 0.201132 0.195156 0.201130 0.213030 0.218885 0.210344 0.213030 0.218885 0.210344 0.223413 0.275736 0.201829 0.223416 0.275727 0.201829
chargesum: 0.00000
title: Mulliken charges with hydrogens summed into heavy atoms:
elementType: O O O O N N C C C C C C C C C C C C C C C C
charge: -0.301495 -0.301489 -0.289021 -0.288998 -0.031197 -0.031199 0.137422 0.137432 0.008390 0.008378 0.228538 0.228548 0.056308 0.056310 0.084548 0.084535 -0.027530 -0.027607 -0.045564 -0.045564 0.179628 0.179627
polarizability: 3.35707395e+02 2.51162697e+01 2.25611166e+02 1.21930298e-03 3.71882182e-03 1.29722978e+02
1716.lowfreq: -6.9831 -6.3698 -0.0009 -0.0008 0.0006 2.9074 15.2962 29.2853 37.3919
frequency: 15.2962 28.1355 37.3082 40.9999 47.4680 57.1098 60.5978 75.2552 89.0444 93.4779 96.8584 114.2931 114.4587 148.8867 161.8496 166.1479 172.7972 181.0336 184.2730 193.6404 202.2825 235.8575 237.4276 241.7923 273.5646 277.8021 320.1365 323.1453 360.5258 385.9083 417.0696 419.8672 435.8716 440.7053 474.2247 478.9883 514.0720 594.2634 634.0469 650.7262 718.2478 732.6311 732.6557 768.3760 770.2893 790.2356 791.7409 806.5362 807.7727 836.8504 887.2659 898.7839 904.4772 931.0287 931.9392 978.1909 1013.9819 1020.3625 1042.9679 1050.5745 1075.1059 1081.4113 1093.9323 1098.8755 1109.9660 1110.1994 1129.4490 1130.9122 1152.0481 1152.0713 1158.7594 1159.7408 1219.8043 1220.1413 1247.4775 1256.7561 1275.8877 1277.1452 1281.9227 1283.9445 1290.4539 1290.6468 1310.7958 1311.4780 1341.0536 1344.8222 1362.4233 1366.1643 1394.0144 1394.0622 1424.2981 1424.8600 1450.2368 1450.5291 1466.4656 1467.7615 1470.7882 1472.3878 1478.3800 1479.4506 1479.4603 1482.8183 1486.0854 1487.4301 1488.6017 1488.9516 1492.8073 1492.9984 1543.5954 1557.1594 1619.7519 1623.4518 2960.9870 2961.0181 2962.7903 2962.7960 2964.1982 2964.9611 2973.5296 2973.5530 2976.0982 2976.1449 3008.2758 3008.2783 3034.5325 3034.5663 3072.2544 3072.2627 3076.8541 3076.8723 3077.1413 3077.2482 3079.7494 3079.7817 3121.9750 3122.0015 3329.0329 3335.3424
redmass: 4.2683 3.9535 2.5271 1.6136 2.1824 3.3580 3.4356 4.2972 2.5423 3.4006 2.7952 1.9799 1.9967 1.7441 1.2422 2.5614 3.4407 3.2563 3.6370 3.4970 4.7712 1.3448 1.1244 2.2764 6.4717 5.0165 7.0518 5.5796 3.9596 3.7991 5.3010 5.8182 8.0003 5.6789 5.0653 4.0888 8.7632 6.5447 9.1813 7.3711 10.6989 1.0707 1.0712 1.1134 1.2140 1.2573 1.1783 5.1232 5.3350 7.4366 4.6572 1.8995 2.1951 1.1919 1.1905 5.7460 5.1095 3.4948 3.5157 3.7071 2.6646 2.3823 3.5412 3.3378 1.2889 1.3220 2.5897 2.6332 1.7574 1.7543 1.5289 1.4924 1.3124 1.3084 1.8794 1.8922 1.2073 1.1550 1.4508 1.6526 1.0996 1.0862 4.0120 6.0067 1.4111 1.5603 1.5906 1.6066 1.2145 1.2146 1.2166 1.1946 1.0764 1.0657 1.1489 1.0767 1.1431 1.0780 1.3377 1.0420 1.0439 1.1294 1.1507 1.0771 1.1134 1.4987 1.2481 1.6449 2.4995 3.0367 11.2007 11.1751 1.0667 1.0663 1.0627 1.0627 1.0357 1.0363 1.0607 1.0608 1.0363 1.0364 1.0977 1.0977 1.1013 1.1013 1.0999 1.0999 1.0992 1.0992 1.0959 1.0958 1.0950 1.0950 1.1049 1.1049 1.0741 1.0750
irintensity: 0.6199 0.4731 0.0427 0.5534 0.3567 0.0791 0.9965 2.3375 3.2044 2.7301 5.2622 0.0220 1.9924 0.0134 0.3234 0.0336 3.4378 0.3625 0.3379 0.0110 3.8305 0.7036 0.0168 3.1595 1.6083 17.7319 3.7101 0.8484 1.3790 0.0965 1.2719 27.0441 0.1894 12.7272 0.4111 30.1694 0.6029 0.5446 7.6780 16.1348 3.9407 1.7953 22.5669 125.2827 1.3774 9.1934 1.3767 5.3688 5.4552 5.5890 14.3587 2.2232 5.8100 5.0635 0.2701 136.6503 23.1883 0.1208 47.8087 3.3259 1.0886 5.1449 85.1041 5.6045 7.6761 3.0544 3.7994 47.9568 0.3595 29.0730 2.0298 14.0807 0.0000 10.5812 0.0319 100.7735 0.1240 9.4154 0.0292 43.5042 2.2356 0.4625 0.9838 58.1440 43.3547 0.1834 135.0372 0.0011 9.3668 1.8389 3.0669 40.2819 89.0793 4.6544 199.9754 0.0600 130.9947 0.0795 456.6155 23.6612 1.3343 0.2236 122.6455 2.0678 93.5083 2.6096 125.9313 0.5930 0.7339 133.1656 435.0288 0.3957 15.9510 10.2519 5.1875 12.3025 69.7415 102.7494 16.4927 115.2644 78.3772 2.6244 2.9746 1.0613 2.9820 59.9701 11.7323 77.9381 75.2432 6.7730 73.0678 12.5588 22.6694 77.2393 27.0123 2.1036 0.1012 175.9797
temp: 298.150 k
press: 1.00000 atm
elementType: 8 8 8 8 7 7 6 6 6 6 6 6 6 6 6 6 6 6 6 6 6 6 1 1 1 1 1 1 1 1 1 1 1 1 1 1 1 1 1 1 1 1 1 1 1 1 1 1
symmnumber: 1
zpe: 1055370.1 jmol-1
zpe.correction: 0.401969 hartree
zpe.thermalcorrener: 0.428047 hartree
zpe.thermalcorrenthalpy: 0.428991 hartree
zpe.thermalcorrgfe: 0.342899 hartree
zpe.sumelectzpe: -1033.941706 hartree
zpe.sumelectthermal: -1033.915629 hartree
zpe.sumelectthermalent: -1033.914684 hartree
zpe.sumelectthermalfe: -1034.000777 hartree
dipole: 0.0001 -0.0001 2.4622
dipole: 2.4622
quadrupole: -100.8112 -140.6151 -131.6818
quadrupole: -5.2475 -0.0005 -0.0017
quadrupole: 23.5581 -16.2457 -7.3124 -5.2475 -0.0005 -0.0017
hfenergy: -1034.3436757 hartree
pointgroup: C01 [X(C16H26N2O4)]
dipole: 0.0000573 0.0000516 -0.9687187 debye
polarizability: 334.2942487|-28.0073589|227.0243131|-0.00112|0.0037499|129.7229776 unknown
InChI: InChI=1S/C16H26N2O4/c1-5-7-9-17-11-13(19)16(22-4)12(18-10-8-6-2)14(20)15(11)21-3/h17-18H,5-10H2,1-4H3
charge 0 multiplicity 1
48 atoms
O  -1.882529 -2.19742 0.165942
O  1.88253 2.19732 0.166083
O  0.987253 -2.562168 0.158581
O  -0.987261 2.56207 0.158885
N  -2.719491 0.612118 0.117619
N  2.719482 -0.612201 0.117633
C  -3.968759 -0.168759 0.096717
C  3.96874 0.168694 0.096759
C  -5.159458 0.725785 0.494446
C  5.159473 -0.725885 0.494301
C  -1.42827 0.189234 0.094356
C  1.428261 -0.189322 0.094359
C  -6.502196 -0.036978 0.438233
C  6.502193 0.036914 0.438134
C  -0.955333 -1.130885 0.081584
C  0.955328 1.130799 0.081623
C  0.460996 -1.383333 0.118346
C  -0.461004 1.383246 0.118346
C  -7.703751 0.846207 0.836882
C  7.703781 -0.846291 0.836637
C  -1.727157 -3.278265 -0.833663
C  1.727273 3.278191 -0.833513
H  -4.135499 -0.584951 -0.918906
H  -3.871273 -1.029664 0.777756
H  4.13541 0.585028 -0.918816
H  3.87129 1.029509 0.777922
H  -5.210449 1.604131 -0.182891
H  -4.998006 1.118601 1.518261
H  5.210448 -1.604133 -0.183163
H  4.99808 -1.11885 1.51807
H  -2.780286 1.646407 0.13528
H  2.780282 -1.646489 0.135317
H  -6.656118 -0.432608 -0.586327
H  -6.450538 -0.91805 1.109178
H  6.65607 0.43267 -0.586383
H  6.450537 0.917904 1.109187
H  -7.589162 1.229875 1.867936
H  -8.65167 0.280012 0.790425
H  -7.796974 1.718218 0.162536
H  7.589244 -1.230072 1.867654
H  8.651688 -0.280073 0.7902
H  7.796994 -1.718229 0.162194
H  -2.564568 -3.966997 -0.641269
H  -0.760844 -3.789675 -0.695325
H  -1.799479 -2.871997 -1.862398
H  2.564675 3.966906 -0.641018
H  0.760953 3.78961 -0.695262
H  1.799694 2.871945 -1.86225
