program: Gaussian 09
title: 000261951
version: EM64L-G09RevD.01
frameworkgroup: C1[X(C16H14N2O2)]
method: RPBEPBE
basis: SDD
operation: Freq
keyword: #p
keyword: freq=noraman
keyword: PBEPBE/SDD
title: #p freq=noraman PBEPBE/SDD
converged: YES YES NO NO
title: Mulliken charges:
elementType: O O N N C C C C C C C C C C C C C C C C H H H H H H H H H H H H H H
charge: -0.235174 -0.247926 -0.468955 0.091755 0.028452 0.025669 0.191283 0.147011 0.208530 0.428311 0.429757 -0.650663 -0.346016 -0.841099 -0.382921 -0.834501 -0.282448 -0.213806 -0.292991 -0.215597 0.320880 0.227729 0.222317 0.242062 0.248145 0.249131 0.238237 0.244256 0.230999 0.231087 0.228054 0.229357 0.285181 0.263895
chargesum: 0.00000
title: Mulliken charges with hydrogens summed into heavy atoms:
elementType: O O N N C C C C C C C C C C C C C C C C
charge: -0.235174 -0.247926 -0.148075 0.091755 0.028452 0.025669 0.191283 0.147011 0.208530 0.428311 0.429757 -0.422933 -0.123699 -0.101761 -0.144684 -0.128159 -0.054394 0.015551 -0.007810 0.048297
polarizability: 4.54516353e+02 -7.73135919e+00 2.17063902e+02 6.49413848e-02 -1.19717353e-01 8.30378645e+01
1716.lowfreq: -77.5410 -5.3984 -0.0004 0.0004 0.0005 5.4741 6.2859 32.2668 51.7549
frequency: -77.5340 32.2627 51.7478 72.7702 97.4489 116.5396 123.7389 139.6181 168.3258 181.5699 214.6764 251.3923 255.6582 281.7727 314.2037 316.6738 354.2150 418.2709 432.2836 435.4057 483.6557 513.6707 520.7027 543.5050 555.1360 590.9172 604.4865 621.1447 640.8367 642.7088 684.5050 700.7409 712.8012 747.7098 755.2637 795.8999 825.3496 840.4948 854.5037 877.0261 882.2966 918.2473 935.0435 944.5515 976.6086 1001.9779 1007.0645 1027.5361 1034.4480 1036.0608 1048.4127 1097.7790 1119.0384 1142.5028 1176.0169 1209.7129 1215.6988 1228.5598 1247.0407 1264.7776 1298.0194 1311.3393 1333.3226 1356.6323 1371.7952 1388.7142 1399.8862 1405.1689 1412.8430 1424.8307 1448.5020 1473.9973 1474.9120 1481.4645 1483.2457 1483.8563 1498.9185 1583.3270 1597.5573 1609.6515 1622.3101 1632.4768 2964.2808 2992.6095 3035.2774 3060.9957 3089.7595 3131.7094 3140.8145 3141.7620 3142.6386 3153.6960 3161.1578 3175.1415 3204.7297 3606.0070
redmass: 1.2809 7.1338 5.7966 7.6092 2.7833 3.3144 2.8610 1.1639 2.7789 4.2292 8.3549 4.1593 3.3635 4.0853 3.5921 3.9714 4.0486 3.4874 5.5166 3.3021 5.0460 5.4957 1.3034 2.4881 7.2000 3.7213 4.0121 4.1669 7.2139 5.7440 6.6608 4.7399 6.0283 1.5776 2.7603 3.7412 4.9486 1.7523 1.5414 3.6053 1.4940 3.9306 1.4006 5.1670 1.3199 1.2367 1.9215 2.0281 1.8912 1.5699 1.5231 3.2736 2.2522 2.2012 1.1632 4.2477 2.1406 1.7940 1.5476 2.5355 1.5689 1.7336 5.0992 2.7202 3.8381 3.1836 1.2292 1.5142 2.5998 3.6832 3.3780 1.0445 1.2642 1.4295 1.7083 1.5875 2.0874 6.4576 6.1125 6.0724 5.8537 7.3334 1.0391 1.0435 1.0978 1.0974 1.0963 1.0861 1.0875 1.0910 1.0902 1.0927 1.0940 1.0972 1.0940 1.0801
irintensity: 0.1358 0.0640 0.6509 2.0422 0.0255 0.3155 5.4104 1.4395 1.5904 0.5495 0.6950 0.3841 0.0021 2.6984 0.5588 0.9135 9.5350 3.4888 1.3948 2.8067 0.1411 0.6587 55.5427 37.1901 14.3596 7.3280 3.6805 0.9808 7.4527 4.4218 0.1022 6.9075 7.5938 71.5746 26.7901 3.7744 0.2965 31.5595 1.3186 2.6359 10.5857 3.4560 1.1621 27.7378 0.4494 39.8591 12.8353 7.0240 1.1183 0.6129 7.4404 23.9517 18.7907 26.3104 15.6586 935.6387 176.2423 57.0416 5.6138 21.9189 4.3339 23.2866 3.4461 91.2464 129.8079 19.4726 17.3951 24.4202 0.0035 33.0690 22.9312 15.8205 13.5353 51.1998 8.2097 79.8098 23.6862 42.2025 450.3478 62.7266 81.7372 11.8694 39.2442 11.5113 20.6652 10.4603 10.2677 0.9114 0.1364 8.3182 9.4543 16.9166 20.2420 29.0278 11.6109 76.5754
temp: 298.150 k
press: 1.00000 atm
elementType: 8 8 7 7 6 6 6 6 6 6 6 6 6 6 6 6 6 6 6 6 1 1 1 1 1 1 1 1 1 1 1 1 1 1
symmnumber: 1
zpe: 690103.9 jmol-1
zpe.correction: 0.262847 hartree
zpe.thermalcorrener: 0.279517 hartree
zpe.thermalcorrenthalpy: 0.280461 hartree
zpe.thermalcorrgfe: 0.218074 hartree
zpe.sumelectzpe: -876.600033 hartree
zpe.sumelectthermal: -876.583362 hartree
zpe.sumelectthermalent: -876.582418 hartree
zpe.sumelectthermalfe: -876.644806 hartree
dipole: 9.3434 3.6512 -0.0033
dipole: 10.0315
quadrupole: -153.6150 -98.5765 -121.3464
quadrupole: -4.2242 -0.1073 0.0115
quadrupole: -29.1024 25.9362 3.1662 -4.2242 -0.1073 0.0115
hfenergy: -876.8628795 hartree
pointgroup: C01 [X(C16H14N2O2)]
dipole: 3.7219271 -1.2943977 -0.219232 debye
polarizability: 453.3366633|16.8249224|217.1016689|-10.1539137|10.267987|84.1797876 unknown
InChI: InChI=1S/C16H14N2O2/c1-10-9-12(7-8-18(19)20)11(2)15-13-5-3-4-6-14(13)17-16(10)15/h3-9,17H,1-2H3
charge 0 multiplicity 1
34 atoms
O  -6.347545 -0.455046 0.204813
O  -5.331684 1.597438 0.315707
N  2.455409 -1.551919 -0.175465
N  -5.289781 0.302861 0.221911
C  0.934456 0.176057 0.00967
C  1.095938 -1.252142 -0.110973
C  2.295776 0.742858 0.016605
C  -0.373882 0.722874 0.091747
C  3.206966 -0.366781 -0.100244
C  0.01375 -2.16962 -0.152647
C  -1.486341 -0.189605 0.054383
C  -1.263083 -1.603704 -0.066408
C  2.854517 2.044349 0.109319
C  -0.607756 2.21916 0.215295
C  4.60743 -0.216875 -0.127104
C  0.249898 -3.660884 -0.281995
C  4.255924 2.208579 0.083804
C  5.125912 1.091284 -0.033343
C  -2.842508 0.336987 0.139462
C  -4.010965 -0.376977 0.128867
H  2.844658 -2.488332 -0.260801
H  -2.127664 -2.275794 -0.094015
H  2.225677 2.933072 0.20213
H  0.334708 2.778462 0.210335
H  -1.222033 2.604464 -0.619274
H  -1.135713 2.472154 1.153393
H  5.273144 -1.082148 -0.2169
H  -0.704318 -4.212503 -0.301218
H  0.793499 -3.910743 -1.214509
H  0.842517 -4.057472 0.566002
H  4.680262 3.215484 0.156182
H  6.209925 1.247243 -0.050515
H  -2.973064 1.422502 0.222666
H  -4.126526 -1.458379 0.056416
