program: Gaussian 09
title: 000261983
version: EM64L-G09RevD.01
frameworkgroup: C1[X(C20H26Cl2O2)]
method: RPBEPBE
basis: SDD
operation: Freq
keyword: #p
keyword: freq=noraman
keyword: PBEPBE/SDD
title: #p freq=noraman PBEPBE/SDD
converged: NO YES NO NO
title: Mulliken charges:
elementType: Cl Cl O O C C C C C C C C C C C C C C C C C C C C H H H H H H H H H H H H H H H H H H H H H H H H H H
charge: -0.048638 -0.069384 -0.450514 -0.247842 0.378336 -0.131246 -0.155240 -0.063072 0.221787 -0.529436 -0.545799 -0.522884 -0.488069 0.099579 -0.447659 -0.780519 -0.645904 0.615526 -0.816469 -0.753284 -0.152055 -0.642435 -0.397666 0.186227 0.239733 0.245218 0.259155 0.244526 0.223936 0.223636 0.338287 0.247234 0.219275 0.231904 0.237678 0.217155 0.243877 0.222619 0.224913 0.244046 0.212082 0.247851 0.231312 0.247017 0.226288 0.257833 0.259133 0.325846 0.261977 0.254130
chargesum: 0.00000
title: Mulliken charges with hydrogens summed into heavy atoms:
elementType: Cl Cl O O C C C C C C C C C C C C C C C C C C C C
charge: -0.048638 -0.069384 -0.124667 -0.247842 0.378336 0.108487 0.089978 -0.063072 0.221787 -0.025755 -0.098228 -0.184597 -0.021559 0.099579 0.021922 -0.096869 -0.176945 0.615526 -0.125225 -0.022146 0.107078 -0.380458 -0.143537 0.186227
polarizability: 2.89016336e+02 -7.44848400e+00 2.12181454e+02 1.99093849e+01 -2.63326926e+00 1.96577635e+02
1716.lowfreq: -12.3693 -8.4325 -6.2578 0.0012 0.0015 0.0024 33.6327 56.5428 62.3980
frequency: 33.4109 56.4259 62.3339 77.7612 105.4011 115.4027 143.3600 159.5462 174.3765 187.7116 204.1411 213.4068 214.6601 216.4815 231.8578 250.5680 257.0832 267.4611 274.0680 295.1147 298.5839 314.3894 322.7464 323.9512 337.9150 363.4889 378.5448 392.5947 414.1467 423.3742 437.3323 465.7529 476.0436 482.8037 502.8610 514.2855 543.3819 554.2182 574.3731 585.0201 616.5004 627.0191 659.6242 687.6424 691.9014 732.4426 748.2976 792.6220 804.5051 821.5733 831.2665 851.5725 867.8638 893.8974 901.0253 908.0732 914.4084 923.5608 944.5777 947.7954 962.9746 969.1907 993.3383 1002.7227 1006.8808 1016.0816 1031.1595 1039.3974 1064.5411 1070.1122 1088.7201 1092.4354 1100.2225 1117.0563 1123.5962 1137.5218 1149.4453 1158.9513 1168.2572 1181.0004 1196.2300 1202.3124 1213.0955 1227.6542 1231.8343 1242.2857 1248.5582 1269.0595 1275.5588 1278.1464 1284.9727 1291.3755 1301.6670 1316.7833 1321.5753 1326.2455 1344.1274 1348.6482 1355.3183 1361.7835 1376.3080 1388.7648 1391.8844 1406.0170 1443.7290 1456.0914 1457.9715 1466.6315 1467.3873 1468.1741 1472.3211 1474.1438 1481.1090 1484.5498 1489.3696 1558.8399 1619.3650 1667.6495 2956.5641 2963.0114 2971.6083 2974.8332 2992.9418 2995.9042 2998.5481 3003.8842 3009.2934 3017.8931 3045.6593 3050.9336 3056.0254 3060.6716 3061.5528 3082.6135 3085.2247 3095.2821 3096.0491 3096.2347 3107.8432 3109.9579 3131.3036 3137.9033 3151.7320 3540.6358
redmass: 6.7709 4.1521 4.9625 2.6486 3.6702 4.7409 4.0703 2.9480 6.1194 3.9466 2.8493 3.5850 3.3992 1.4030 2.4684 2.8420 2.0592 2.4188 2.0494 2.1879 2.2205 1.6036 3.6696 3.0923 2.3085 4.0514 2.6927 2.7684 3.1174 3.1581 3.6137 3.7250 3.9223 3.1388 4.1107 3.8839 2.9848 3.0598 4.0542 4.6203 3.9893 3.9531 4.2784 2.9642 3.6405 3.4902 4.1140 1.6972 2.2863 1.6588 1.8544 2.5093 2.7224 2.0867 2.4264 1.8070 1.9242 1.9422 1.9090 1.8745 2.0622 2.2304 2.2725 1.5041 3.4590 1.7725 2.1220 1.8270 1.9268 2.0364 2.1684 1.7252 2.3742 2.2540 2.2345 2.1475 2.1590 1.9103 2.0060 1.8954 1.9475 1.3998 1.5203 1.2943 1.3537 1.6929 1.4581 1.3023 1.4263 1.3976 1.5942 2.0880 1.7729 1.7786 1.4006 1.4489 1.7657 1.6143 1.4211 1.4252 1.8975 1.2865 1.2127 1.1939 1.0827 1.0795 1.0664 1.0752 1.0713 1.0643 1.0569 1.0571 1.0572 1.0563 1.0821 8.7653 8.6288 7.4635 1.0785 1.0658 1.0439 1.0758 1.0587 1.0609 1.0606 1.0364 1.0372 1.0644 1.0940 1.1005 1.0999 1.1028 1.0975 1.0993 1.1029 1.0949 1.0973 1.0924 1.0870 1.0984 1.0920 1.0982 1.0977 1.0657
irintensity: 2.6836 2.1498 1.0901 0.6647 0.8364 0.1197 3.5166 1.6318 4.6120 0.3949 0.7614 1.4026 0.9592 5.0345 2.1545 3.7559 30.5595 22.6346 54.1160 4.0696 17.9080 0.4063 0.8443 10.4891 0.8062 8.8413 3.6600 1.1232 4.5695 5.2404 4.7892 5.7640 8.4272 11.5406 9.6813 0.2048 21.4810 1.3342 0.1416 46.5330 2.7953 1.4021 2.5404 8.6465 5.3985 5.1153 5.5362 4.1025 2.9763 9.9852 9.9423 2.1080 2.2823 20.6592 30.0601 40.6826 9.2182 1.6020 5.5291 7.6297 2.6154 9.3252 3.3325 2.2542 7.8420 4.8855 20.2803 1.0589 31.2141 19.0567 38.3440 19.6101 4.2622 37.4086 1.1954 18.8904 0.5725 4.7414 14.5271 9.7555 1.4320 5.8370 0.5134 23.1549 0.5409 20.6393 2.0151 2.9936 6.8499 36.6333 8.5209 11.7853 3.7084 10.9523 3.6372 1.9188 1.0189 3.9085 1.2005 2.6724 15.5919 29.8353 9.3751 23.0458 11.0320 12.5243 17.7746 17.0912 3.3039 17.8532 11.1786 2.5686 4.1002 4.9593 7.5673 198.5395 15.3487 124.2217 1.2726 18.9711 10.9621 14.3386 15.5879 32.8115 31.1647 21.5067 16.5122 28.9999 25.2785 9.4918 28.9642 19.3451 18.8119 29.6879 34.9290 8.3059 24.8087 16.1623 4.5487 30.4061 8.3724 6.4906 11.2141 4.3906
temp: 298.150 k
press: 1.00000 atm
elementType: 17 17 8 8 6 6 6 6 6 6 6 6 6 6 6 6 6 6 6 6 6 6 6 6 1 1 1 1 1 1 1 1 1 1 1 1 1 1 1 1 1 1 1 1 1 1 1 1 1 1
symmnumber: 1
zpe: 1087930.6 jmol-1
zpe.correction: 0.414371 hartree
zpe.thermalcorrener: 0.437639 hartree
zpe.thermalcorrenthalpy: 0.438583 hartree
zpe.thermalcorrgfe: 0.364427 hartree
zpe.sumelectzpe: -1846.450791 hartree
zpe.sumelectthermal: -1846.427523 hartree
zpe.sumelectthermalent: -1846.426579 hartree
zpe.sumelectthermalfe: -1846.500734 hartree
dipole: -4.5672 -0.0834 -1.7687
dipole: 4.8984
quadrupole: -202.0911 -153.2046 -155.1016
quadrupole: 5.6427 -18.6854 9.0273
quadrupole: -31.9587 16.9278 15.0308 5.6427 -18.6854 9.0273
hfenergy: -1846.8651617 hartree
pointgroup: C01 [X(C20H26Cl2O2)]
dipole: -1.7959946 0.1723698 0.6773216 debye
polarizability: 288.9146554|3.3320888|210.4468849|-21.191087|-5.6482158|198.4138849 unknown
InChI: InChI=1S/C20H26Cl2O2/c1-17-8-6-13(23)10-12(17)4-5-15-14-7-9-19(3,24)18(14,2)11-16(21)20(15,17)22/h6,8,10,14-16,24H,4-5,7,9,11H2,1-3H3
charge 0 multiplicity 1
50 atoms
Cl 0.717919 0.230008 -1.884087
Cl -0.316362 -2.864003 1.241452
O  -5.142252 -0.731798 -0.195861
O  5.681496 0.230634 -1.305702
C  -2.608287 -0.425105 0.046431
C  -1.799555 0.906448 0.023067
C  -0.402862 0.803776 0.670312
C  0.43913 -0.325836 0.010894
C  -3.964451 0.058144 -0.627808
C  -1.79843 -1.485363 -0.738308
C  -2.799095 1.953115 0.573126
C  -0.332196 -1.650792 -0.2730
C  -4.168444 1.492598 -0.026467
C  1.918278 -0.416538 0.587468
C  0.323845 2.172426 0.627324
C  -2.937813 -0.896606 1.489714
C  1.800679 2.114822 1.092856
C  2.561538 0.972049 0.452793
C  -3.944441 0.076918 -2.172132
C  1.960848 -0.758965 2.132892
C  2.71645 -1.508926 -0.103233
C  3.779413 1.146293 -0.141869
C  3.928836 -1.305838 -0.68734
C  4.546829 0.041723 -0.753869
H  -1.617237 1.160177 -1.042242
H  -0.525024 0.503609 1.732826
H  -1.73673 -1.187329 -1.802302
H  -2.276541 -2.482474 -0.705012
H  -2.540639 2.982125 0.268655
H  -2.821429 1.933258 1.679087
H  0.233524 -2.246775 -1.003125
H  -4.961756 1.438594 0.737905
H  -4.517946 2.187772 -0.810055
H  -0.232663 2.888173 1.259901
H  0.285777 2.551503 -0.411044
H  -2.039092 -0.975574 2.122293
H  -3.657213 -0.217469 1.975572
H  -3.407351 -1.894612 1.47157
H  1.824142 1.993749 2.19615
H  2.303416 3.073213 0.870934
H  -3.858959 -0.942089 -2.597185
H  -4.890825 0.514079 -2.535939
H  -3.111835 0.681263 -2.575423
H  2.978783 -0.540468 2.499989
H  1.246256 -0.153163 2.714376
H  1.739768 -1.819032 2.315567
H  2.295432 -2.521416 -0.042197
H  -5.113647 -1.619436 -0.637517
H  4.240147 2.140328 -0.197774
H  4.49987 -2.127484 -1.134968
