program: Gaussian 09
title: 000261937
version: EM64L-G09RevD.01
frameworkgroup: C1[X(C11H20N4)]
method: RPBEPBE
basis: SDD
operation: Freq
keyword: #pfreq=noraman
keyword: PBEPBE/SDD
title: #p freq=noraman PBEPBE/SDD
converged: YES YES NO NO
title: Mulliken charges:
elementType: N N N N C C C C C C C C C C C H H H H H H H H H H H H H H H H H H H H
charge: -0.348752 -0.348745 -0.041198 -0.040958 -0.440247 -0.354507 -0.354205 0.268282 0.268652 -0.690786 -0.721874 -0.690878 -0.722221 -0.163001 -0.163741 0.196302 0.196425 0.246289 0.190710 0.246332 0.190554 0.249064 0.248974 0.236695 0.228931 0.211403 0.293362 0.218685 0.200519 0.236555 0.228949 0.211359 0.294082 0.218564 0.200427
chargesum: 0.00000
title: Mulliken charges with hydrogens summed into heavy atoms:
elementType: N N N N C C C C C C C C C C C
charge: -0.099687 -0.099771 -0.041198 -0.040958 -0.047521 0.082493 0.082681 0.268282 0.268652 -0.013758 -0.009309 -0.014015 -0.009148 -0.163001 -0.163741
polarizability: 1.51787639e+02 -4.58669369e-03 1.37457171e+02 -1.00716291e+01 -1.83576277e-02 1.25827040e+02
1716.lowfreq: -4.8013 -0.0007 -0.0006 -0.0006 8.3671 13.1980 51.4631 54.6583 57.6351
frequency: 51.4596 54.6580 57.6280 78.8993 106.6911 122.6689 149.8372 178.4828 179.6550 193.2445 207.1982 214.2225 219.3205 221.9283 234.5197 259.3484 259.5433 302.3817 342.9136 368.4015 388.3308 392.8898 411.8092 413.1715 465.4566 512.0258 549.9334 566.4227 567.3901 597.8635 604.5618 684.4063 697.5269 801.7025 866.0651 880.4613 899.3857 903.6120 923.7621 924.7751 929.6451 999.8497 1001.8939 1004.9034 1019.5617 1084.6326 1091.3534 1134.4280 1154.2455 1158.0367 1172.8386 1187.7957 1201.2247 1208.5826 1256.1185 1263.2314 1294.4047 1352.0177 1358.6148 1368.6515 1373.7366 1378.5223 1393.5562 1393.8666 1434.5810 1441.6330 1456.6925 1456.8158 1462.8658 1464.8058 1465.6429 1471.2651 1474.7848 1478.0143 1478.4032 1490.2595 1490.4975 2188.6640 2188.9117 2885.1424 2886.2653 2970.4189 2980.8400 2980.9013 2985.9889 2986.4119 3015.4995 3043.4666 3048.4367 3079.8852 3079.9265 3086.7969 3086.8258 3093.6601 3093.7773 3114.0108 3114.0651 3463.9051 3464.2378
redmass: 4.1300 4.9892 6.6403 5.1798 3.0090 5.5349 4.2859 3.3751 3.6999 3.0470 1.6657 2.1036 1.0960 1.2257 2.0681 1.1315 1.1367 2.1736 2.3985 2.4386 2.4028 2.3254 4.0533 3.7908 2.7892 1.6358 1.6430 5.1473 5.1751 4.5923 4.9448 3.9022 3.8688 1.4608 2.9057 1.7935 2.0586 2.1853 1.5757 1.6601 2.1074 1.4683 1.2926 1.4885 1.8983 2.3268 1.9362 2.8469 3.1901 2.8714 1.7847 2.8017 1.6647 2.7713 1.9837 1.8618 1.1531 1.3445 1.3536 1.2325 1.1879 1.2422 1.1951 1.1972 1.1997 1.1973 1.0516 1.0538 1.0747 1.0511 1.0590 1.0717 1.0632 1.0768 1.0757 1.0865 1.0878 12.6339 12.6338 1.0703 1.0714 1.0610 1.0348 1.0348 1.0367 1.0366 1.0981 1.0884 1.0910 1.0998 1.0998 1.0981 1.0981 1.1004 1.1004 1.1021 1.1021 1.0746 1.0746
irintensity: 7.2901 1.5148 0.8270 1.2690 2.0142 3.5672 9.0786 0.3946 1.6855 0.4475 5.1133 4.2405 0.1068 4.4174 0.0944 0.0200 2.9728 1.3731 0.0001 4.9532 0.3019 20.2680 1.7783 0.2902 0.0066 223.9822 1.6035 8.8637 1.2522 7.2251 1.0046 3.6689 2.0570 2.5166 0.3774 3.3143 0.9159 2.2919 1.1276 3.7900 2.0202 0.3115 0.5357 2.7040 16.4443 7.3029 0.7937 6.5308 0.1943 68.0409 2.1090 69.5110 8.8214 154.4443 13.5880 9.3601 0.0538 13.6289 3.5131 4.5161 25.4741 1.0782 42.1519 13.5244 5.1845 10.4558 8.0378 2.6493 10.8509 6.8156 0.8410 1.4622 12.9777 4.7167 2.1738 11.0042 16.9656 7.9744 0.8617 123.4930 82.3397 75.6180 25.8403 5.9785 72.1229 0.0813 20.6298 11.3404 27.5012 4.5784 1.2984 46.4443 38.4514 23.0821 29.5978 8.4514 6.4614 0.7885 0.8846
temp: 298.150 k
press: 1.00000 atm
elementType: 7 7 7 7 6 6 6 6 6 6 6 6 6 6 6 1 1 1 1 1 1 1 1 1 1 1 1 1 1 1 1 1 1 1 1
symmnumber: 1
zpe: 780806.0 jmol-1
zpe.correction: 0.297393 hartree
zpe.thermalcorrener: 0.315771 hartree
zpe.thermalcorrenthalpy: 0.316715 hartree
zpe.thermalcorrgfe: 0.252348 hartree
zpe.sumelectzpe: -648.930822 hartree
zpe.sumelectthermal: -648.912444 hartree
zpe.sumelectthermalent: -648.911500 hartree
zpe.sumelectthermalfe: -648.975867 hartree
dipole: -0.0177 4.6695 -0.0104
dipole: 4.6695
quadrupole: -73.8200 -96.0446 -97.9221
quadrupole: 0.0294 -7.1672 0.0172
quadrupole: 15.4422 -6.7823 -8.6598 0.0294 -7.1672 0.0172
hfenergy: -649.2282149 hartree
pointgroup: C01 [X(C11H20N4)]
dipole: 0.0099142 1.8370917 -0.0078721 debye
polarizability: 150.4561824|-0.0862361|137.4572171|-11.5854183|-0.0296313|127.1584511 unknown
InChI: InChI=1S/C11H20N4/c1-10(2,8-12)14-6-5-7-15-11(3,4)9-13/h14-15H,5-7H2,1-4H3
charge 0 multiplicity 1
35 atoms
N  1.616467 0.993975 -0.64259
N  -1.617148 1.006116 0.620376
N  1.105789 -1.598664 1.59611
N  -1.126846 -1.616719 -1.588524
C  0.001364 2.786853 -0.023381
C  1.209116 1.930968 0.421814
C  -1.208797 1.928333 -0.456555
C  2.421544 -0.201613 -0.283925
C  -2.429349 -0.189603 0.278102
C  3.834823 0.141719 0.295981
C  2.55237 -1.091179 -1.551964
C  -3.843911 0.154166 -0.298386
C  -2.557938 -1.065304 1.555966
C  1.678263 -0.975688 0.755752
C  -1.694735 -0.977776 -0.757095
H  -0.278902 3.457905 0.81494
H  0.283398 3.445907 -0.870591
H  0.889125 1.322672 1.287014
H  2.029526 2.606097 0.764616
H  -0.891067 1.308151 -1.314138
H  -2.027986 2.600926 -0.807226
H  1.984498 1.448522 -1.48757
H  -1.981151 1.472631 1.460599
H  3.748467 0.803499 1.17508
H  4.379043 -0.770438 0.599096
H  4.425534 0.660812 -0.481377
H  1.552793 -1.376853 -1.917885
H  3.13586 -2.002195 -1.336113
H  3.079218 -0.523821 -2.342717
H  -3.758874 0.806318 -1.184762
H  -4.393878 -0.758554 -0.589161
H  -4.42824 0.684156 0.476436
H  -1.557828 -1.351142 1.920304
H  -3.146016 -1.976149 1.352248
H  -3.07893 -0.487632 2.343126
