program: Gaussian 09
title: 000026625
version: EM64L-G09RevD.01
frameworkgroup: C1[X(C16H18N2O4)]
method: RPBEPBE
basis: SDD
operation: Freq
keyword: #p
keyword: freq=noraman
keyword: PBEPBE/SDD
title: #p freq=noraman PBEPBE/SDD
converged: YES YES NO NO
title: Mulliken charges:
elementType: O O O O N N C C C C C C C C C C C C C C C C H H H H H H H H H H H H H H H H H H
charge: -0.483801 -0.211817 -0.220520 -0.218271 -0.338335 -0.368177 0.099352 -0.480673 -0.539532 0.167421 -0.021706 0.172055 0.159114 -0.732247 -0.031767 0.506319 -0.340690 -0.322761 -0.598951 -0.218676 -0.216244 -0.234712 0.244439 0.253269 0.255558 0.225821 0.234292 0.359810 0.239084 0.208393 0.224554 0.261105 0.350780 0.240802 0.245387 0.220551 0.220585 0.229725 0.229235 0.231230
chargesum: 0.00000
title: Mulliken charges with hydrogens summed into heavy atoms:
elementType: O O O O N N C C C C C C C C C C C C C C C C
charge: -0.133021 -0.211817 -0.220520 -0.218271 -0.338335 -0.008367 0.099352 0.017035 -0.058154 0.167421 0.212586 0.172055 0.159114 -0.060216 0.229338 0.506319 -0.099888 -0.077373 -0.157815 0.011049 0.012992 -0.003482
polarizability: 2.44684179e+02 1.33720751e+01 1.92628398e+02 1.01375684e+01 -8.10503238e+00 1.50234832e+02
1716.lowfreq: -10.7775 0.0003 0.0007 0.0008 4.5954 6.6973 20.3317 29.2488 41.3759
frequency: 20.2135 29.1058 41.3505 54.1075 61.0969 67.5590 87.1347 95.6527 132.2915 148.7418 155.8249 171.7929 200.0762 232.1199 236.8653 249.1521 257.4733 266.3393 278.6049 312.3009 336.1944 381.5250 402.0741 405.7441 408.2038 425.9262 456.1556 477.6040 506.2042 516.8047 533.9729 594.3064 613.5600 625.2514 657.2305 674.7680 694.4440 702.9596 713.3955 739.6172 764.7198 777.3785 792.7257 837.6919 839.7858 866.4652 889.3956 915.2994 931.2182 943.1738 954.0338 969.0420 985.1636 991.4860 994.2647 994.9930 1010.3001 1023.8881 1045.6934 1056.5166 1080.0630 1086.6799 1092.8217 1120.8840 1144.6958 1173.0360 1180.5580 1183.5608 1213.8740 1229.6518 1252.4374 1282.1871 1294.5562 1303.6785 1313.7836 1319.1203 1327.0261 1347.8779 1357.3471 1380.2957 1383.6777 1385.8788 1387.9073 1428.1287 1440.9308 1452.0580 1460.7862 1469.7743 1474.1402 1481.3284 1586.5525 1604.4253 1610.5584 1644.6341 1654.9434 1656.0659 2963.3335 2976.1758 2986.5646 3014.7555 3046.1517 3068.4608 3082.9929 3086.5127 3090.6656 3117.2851 3131.5530 3141.4727 3153.3774 3163.4623 3173.6011 3196.4745 3520.7206 3573.4294
redmass: 4.1140 4.4562 7.2243 4.2547 4.1750 3.0916 3.3439 4.0056 4.0757 6.7075 4.9056 5.3336 3.7958 3.2668 1.5902 1.9459 2.0077 1.8170 4.8090 3.2651 2.8316 6.3863 11.2556 2.7967 3.0826 4.9149 2.4659 3.5829 3.1376 4.2137 6.6997 5.7902 6.1071 2.0658 2.5277 4.4932 1.9721 4.4536 8.0715 3.5978 1.9619 1.9739 3.3081 1.4629 2.6437 2.1696 1.6829 1.4637 2.4028 1.7249 1.3804 1.3982 1.9040 5.8755 1.3338 3.0310 1.2190 2.3486 2.6032 2.8446 1.6633 1.8497 2.2539 2.6119 3.8016 1.0527 1.4221 1.7336 1.3830 3.9698 1.4367 1.4090 1.3168 1.3875 1.3231 1.4537 2.7918 1.3214 6.9178 1.7936 1.5642 9.9234 1.2250 1.1792 2.2431 1.0951 1.1011 1.0503 1.0631 2.3756 10.8108 6.9056 6.4493 5.9170 6.1434 6.2937 1.0636 1.0373 1.0842 1.0611 1.0969 1.0984 1.1016 1.0605 1.1001 1.0938 1.0850 1.0887 1.0934 1.0972 1.1013 1.1142 1.0765 1.0662
irintensity: 0.3069 0.1070 0.1011 0.2944 0.9999 1.4243 2.4640 0.9730 0.6325 2.6966 2.7539 8.7265 1.1331 17.5532 13.8154 9.0729 65.2996 41.8845 2.9210 13.0226 2.2337 8.9363 4.8019 0.3610 12.0773 5.3823 7.2033 2.8076 6.0991 39.3245 40.9444 1.8666 0.6023 4.6842 23.6336 5.3873 36.4919 15.8129 0.8485 13.5937 19.8202 107.4595 17.5441 1.5691 8.8158 2.9226 2.9367 1.2159 15.7934 18.5324 79.9290 0.3062 24.8725 2.0577 0.1311 8.7033 9.0291 7.5958 16.9600 1.6147 10.3262 19.9793 35.5843 3.0680 41.6427 0.0119 11.3101 28.8492 41.8740 45.0107 11.4226 10.0818 30.2150 41.3490 8.4655 45.3010 294.4188 33.9961 309.4483 3.9798 9.8200 3.3375 16.7406 4.9626 8.0789 23.3303 20.0146 11.4959 8.2849 42.9768 275.9812 18.1899 23.1535 390.6761 150.1290 62.2862 18.7817 27.0593 19.3440 9.6986 8.3003 30.4378 0.5754 10.4229 27.2741 3.9679 0.2726 5.0833 31.2623 20.8108 7.4128 19.6014 64.6828 5.2176
temp: 298.150 k
press: 1.00000 atm
elementType: 8 8 8 8 7 7 6 6 6 6 6 6 6 6 6 6 6 6 6 6 6 6 1 1 1 1 1 1 1 1 1 1 1 1 1 1 1 1 1 1
symmnumber: 1
zpe: 824465.7 jmol-1
zpe.correction: 0.314022 hartree
zpe.thermalcorrener: 0.335441 hartree
zpe.thermalcorrenthalpy: 0.336385 hartree
zpe.thermalcorrgfe: 0.262275 hartree
zpe.sumelectzpe: -1029.299755 hartree
zpe.sumelectthermal: -1029.278336 hartree
zpe.sumelectthermalent: -1029.277392 hartree
zpe.sumelectthermalfe: -1029.351502 hartree
dipole: 0.0117 0.4348 -2.5790
dipole: 2.6154
quadrupole: -125.2099 -119.4927 -131.5869
quadrupole: 0.1585 0.2608 11.4185
quadrupole: 0.2199 5.9371 -6.1571 0.1585 0.2608 11.4185
hfenergy: -1029.6137771 hartree
pointgroup: C01 [X(C16H18N2O4)]
dipole: -0.0262988 0.6223653 0.8189983 debye
polarizability: 238.0089942|-11.4160817|192.4196792|23.4850984|-16.0847045|157.1187346 unknown
InChI: InChI=1S/C16H18N2O4/c1-3-9-16(10-11(2)19)13(20)17-15(22)18(14(16)21)12-7-5-4-6-8-12/h3-8,11,17,19H,1,9-10H2,2H3
charge 0 multiplicity 1
40 atoms
O  -1.879528 -1.195985 1.643095
O  0.084667 1.518698 0.730473
O  -2.974502 -1.500987 -1.4749
O  1.498339 -2.577261 -1.039551
N  0.844869 -0.452419 -0.2540
N  -0.722643 -1.950238 -1.257574
C  -1.557845 0.307729 -0.600243
C  -2.674238 0.717501 0.402112
C  -1.633731 1.219216 -1.904544
C  -0.174061 0.503123 0.033077
C  -2.464288 0.160424 1.823555
C  -1.835595 -1.115037 -1.106671
C  0.603142 -1.714659 -0.860234
C  -3.773826 0.101228 2.622795
C  -1.526009 2.708123 -1.652082
C  2.202008 -0.179284 0.212822
C  2.923965 0.889598 -0.358635
C  2.770537 -0.97613 1.228784
C  -2.415827 3.617036 -2.123985
C  4.231691 1.1656 0.095459
C  4.081557 -0.69982 1.673459
C  4.813219 0.371248 1.110444
H  -3.628642 0.346221 -0.014952
H  -2.724318 1.817872 0.458426
H  -2.595096 0.987627 -2.39954
H  -0.825808 0.896937 -2.594984
H  -1.720815 0.791314 2.352226
H  -0.893506 -2.880674 -1.652452
H  -4.488837 -0.585831 2.136313
H  -3.60053 -0.245482 3.659478
H  -4.2376 1.103363 2.681246
H  -0.661345 3.049419 -1.066891
H  -1.749036 -1.618708 2.528209
H  2.466095 1.499934 -1.143673
H  2.20074 -1.808479 1.652605
H  -2.282765 4.690549 -1.949093
H  -3.298921 3.315857 -2.701972
H  4.794717 1.995844 -0.344048
H  4.530249 -1.320162 2.456657
H  5.829816 0.584095 1.458787
