program: Gaussian 09
title: 000262009
version: EM64L-G09RevD.01
frameworkgroup: C1[X(C26H24ClNO)]
method: RPBEPBE
basis: SDD
operation: Freq
keyword: #p
keyword: freq=noraman
keyword: PBEPBE/SDD
title: #p freq=noraman PBEPBE/SDD
converged: YES YES NO NO
title: Mulliken charges:
elementType: Cl O N C C C C C C C C C C C C C C C C C C C C C C C C C C H H H H H H H H H H H H H H H H H H H H H H H H
charge: -0.031997 -0.454477 -0.065473 -0.140741 0.225692 0.414226 0.358489 0.392110 -0.677443 -0.537601 0.413770 -0.592939 0.484039 -0.349463 -0.378017 -0.417015 -0.404560 -0.445604 -0.391358 -0.248706 -0.636209 -0.625553 -0.255713 -0.225709 -0.230641 -0.249656 -0.235831 -0.243057 -0.247162 0.273991 0.231649 0.282227 0.355606 0.256060 0.271139 0.247327 0.262116 0.250919 0.264905 0.218701 0.199962 0.217699 0.191798 0.230284 0.219179 0.231566 0.228142 0.223684 0.225497 0.227134 0.231274 0.228511 0.227229
chargesum: 0.00000
title: Mulliken charges with hydrogens summed into heavy atoms:
elementType: Cl O N C C C C C C C C C C C C C C C C C C C C C C C C C C
charge: -0.031997 -0.098871 -0.065473 -0.140741 0.225692 0.414226 0.358489 0.392110 -0.403452 -0.023725 0.413770 -0.592939 0.484039 -0.093403 -0.106878 -0.169688 -0.142444 -0.194685 -0.126453 -0.017139 0.000153 0.015708 -0.027570 -0.002025 -0.005144 -0.022522 -0.004558 -0.014546 -0.019933
polarizability: 3.37376258e+02 -1.83813181e+01 3.46788568e+02 2.28286858e+01 3.28785801e+00 2.33774625e+02
1716.lowfreq: -7.6052 -0.0007 0.0010 0.0014 2.8157 6.5405 22.0698 32.9665 43.4348
frequency: 21.9939 32.9359 43.4105 49.6903 53.2209 61.7023 64.1318 74.9177 90.9480 108.5585 154.1880 159.0979 163.2737 202.6926 214.6229 225.9204 249.3301 249.6786 253.5490 265.2128 279.3668 291.0343 297.9993 301.9223 314.2714 344.5729 356.6711 380.3069 391.9367 402.2271 405.5396 424.6453 443.4761 466.4035 483.8918 516.4891 536.8220 542.0751 550.5836 579.5800 603.9199 615.5289 616.1768 634.5384 648.2705 670.7865 699.9627 704.9191 708.2921 753.7266 759.0174 763.4644 776.7084 793.7024 818.9798 827.5802 855.0331 861.6963 867.6691 883.5788 893.3286 911.6241 922.6295 928.7309 941.1063 965.5063 970.6113 979.9513 981.5132 985.9056 989.7378 990.2851 994.5666 996.6890 997.3040 1023.3602 1027.4230 1029.7049 1030.3118 1041.1694 1068.6670 1083.6071 1093.0253 1098.2205 1133.5245 1144.8572 1147.0342 1167.4133 1172.0399 1172.4301 1175.6768 1182.2953 1190.7261 1194.2631 1218.3021 1244.9236 1257.0482 1263.0035 1284.5826 1290.3751 1315.5454 1317.7213 1322.4175 1362.0324 1377.3215 1378.9646 1390.3473 1411.2151 1416.4808 1430.4529 1431.8190 1435.3984 1437.1351 1441.4171 1459.8491 1460.7859 1475.4342 1477.4956 1479.6692 1480.9501 1485.4707 1491.5526 1564.0659 1588.8070 1590.7104 1594.2819 1606.7582 1610.8959 1631.5920 2849.5621 2864.3981 2970.3058 3007.1839 3012.0063 3023.5856 3062.1866 3072.4761 3120.2083 3123.7862 3125.5887 3128.8409 3132.6440 3138.7454 3141.3750 3146.2143 3155.1368 3157.4026 3157.7166 3157.9709 3168.4937 3170.7091 3172.9416 3562.9997
redmass: 5.3838 4.3816 6.0347 3.4033 3.8923 4.4077 4.0355 4.2252 3.4008 5.0071 4.7567 4.7709 6.1370 6.1794 4.7647 1.3502 4.7463 4.1063 3.9355 3.7241 2.5628 2.7561 1.4620 2.8623 1.7085 2.9113 3.7017 2.9496 4.4058 2.8190 2.8594 2.5665 3.5319 4.1934 4.0163 4.1201 4.1194 4.2714 4.0087 5.1685 5.6786 6.4018 6.4051 5.7497 6.1764 6.0129 5.2848 1.8437 1.7487 2.8449 2.0047 1.4185 2.3183 3.1501 4.7186 5.2418 1.2536 1.2484 1.6997 2.2721 3.5234 3.7842 1.7263 1.7121 1.7405 4.0241 1.4655 1.4517 2.0739 1.4429 4.8356 5.0167 1.3332 1.3595 1.3267 2.4537 2.3329 2.1751 2.1931 1.5168 2.7852 1.6220 1.2728 1.7690 1.3811 1.9206 1.8607 1.7740 1.0695 1.0540 1.3453 2.0529 1.1736 1.1543 1.9843 2.4983 2.3639 2.1041 1.8505 1.8210 1.3749 1.9184 1.4185 1.7009 7.2549 8.5361 2.3616 3.5386 1.1402 2.2555 2.5338 3.3796 3.0876 1.2052 1.0710 1.0848 1.1010 2.0957 1.5967 1.3741 2.6568 1.0530 7.2575 6.1189 6.2501 6.1798 6.0409 6.0622 6.9118 1.0562 1.0556 1.0578 1.0748 1.0721 1.1008 1.0996 1.1006 1.0853 1.0845 1.0865 1.0879 1.0881 1.0900 1.0934 1.0930 1.0908 1.0970 1.0958 1.0953 1.0989 1.0978 1.0980 1.0663
irintensity: 0.0778 0.0941 0.4532 0.7044 0.0420 0.6726 0.2197 0.0824 0.4764 0.3174 0.0961 0.2653 0.2619 1.4171 1.4599 0.5014 3.3305 10.7467 0.2811 4.5766 48.1054 42.7764 18.7746 25.7403 79.7226 24.7395 2.4694 2.4847 3.3167 2.2094 0.6306 1.3837 2.3402 1.9864 6.8893 2.8625 5.1912 1.2135 1.8942 23.0998 2.7439 0.2269 0.0565 11.3889 25.8040 2.7145 5.1818 35.0731 61.9246 28.2807 63.7238 42.9623 46.7521 11.3180 12.3637 13.7924 0.1069 0.1371 31.1276 5.7713 13.2132 18.4842 9.6786 15.9194 5.7990 38.1496 2.0187 0.6626 7.1220 0.5478 1.2312 0.8876 0.0638 0.0684 0.7528 55.0315 11.8013 7.4270 23.1467 11.4390 17.8187 1.0542 3.5009 3.0655 3.9685 10.2407 26.6573 3.7350 1.1383 0.1176 4.0272 10.5768 4.7892 0.7704 4.1634 21.1048 12.7247 29.8398 62.2052 18.2435 2.1041 5.6319 17.6644 17.0418 0.2462 1.7759 19.7576 2.2300 3.6534 5.0628 2.0781 8.9021 14.4999 5.9943 7.3700 12.2132 8.1151 20.6690 19.6183 9.6807 15.0101 17.1943 6.7042 1.2588 1.2497 11.1943 7.3622 6.1792 0.9771 100.2039 148.4447 55.3825 33.7967 46.6943 9.4728 47.0251 46.0435 4.0885 1.0054 0.7268 3.3161 7.0514 12.5551 29.5884 26.0401 0.9220 17.7605 23.1410 31.0851 19.9207 12.9547 21.0517 15.4995
temp: 298.150 k
press: 1.00000 atm
elementType: 17 8 7 6 6 6 6 6 6 6 6 6 6 6 6 6 6 6 6 6 6 6 6 6 6 6 6 6 6 1 1 1 1 1 1 1 1 1 1 1 1 1 1 1 1 1 1 1 1 1 1 1 1
symmnumber: 1
zpe: 1113633.5 jmol-1
zpe.correction: 0.424161 hartree
zpe.thermalcorrener: 0.450053 hartree
zpe.thermalcorrenthalpy: 0.450997 hartree
zpe.thermalcorrgfe: 0.367807 hartree
zpe.sumelectzpe: -1593.139170 hartree
zpe.sumelectthermal: -1593.113278 hartree
zpe.sumelectthermalent: -1593.112334 hartree
zpe.sumelectthermalfe: -1593.195523 hartree
dipole: 0.9778 1.8665 0.1908
dipole: 2.1158
quadrupole: -175.8902 -161.4476 -167.7114
quadrupole: -3.2163 1.1487 0.5278
quadrupole: -7.5405 6.9022 0.6383 -3.2163 1.1487 0.5278
hfenergy: -1593.5633307 hartree
pointgroup: C01 [X(C26H24Cl1N1O1)]
dipole: -0.1706626 0.8127778 -0.0562131 debye
polarizability: 346.5484151|17.6906226|336.9800855|24.2613457|-6.0112966|234.4109505 unknown
InChI: InChI=1S/C26H24ClNO/c1-28(2)18-23-24(17-19-11-9-10-16-22(19)25(23)27)26(29,20-12-5-3-6-13-20)21-14-7-4-8-15-21/h3-17,29H,18H2,1-2H3
charge 0 multiplicity 1
53 atoms
Cl 3.310756 -2.622313 0.655076
O  -1.432264 -0.551705 -1.850918
N  1.097135 -3.232193 -1.497453
C  -1.212944 0.092263 -0.524426
C  0.310716 0.090605 -0.223324
C  1.049502 -1.160986 -0.096529
C  -1.821912 1.523927 -0.55421
C  -2.035173 -0.738804 0.485341
C  0.989781 1.304481 -0.079625
C  0.425504 -2.530984 -0.371649
C  2.381525 1.374573 0.234562
C  2.394204 -1.076685 0.291935
C  3.119541 0.151141 0.458371
C  -1.997657 2.264782 0.644116
C  -3.269324 -1.302133 0.074598
C  -2.235788 2.106669 -1.775083
C  -1.631126 -0.874097 1.835577
C  3.056614 2.632594 0.36321
C  4.505244 0.233688 0.813989
C  4.409196 2.686293 0.702989
C  0.907726 -2.604829 -2.814833
C  0.812289 -4.67645 -1.501313
C  -2.555893 3.560033 0.617753
C  -4.075358 -2.003475 0.99621
C  -2.798409 3.404459 -1.804312
C  -2.440796 -1.573357 2.759284
C  5.135555 1.47502 0.93105
C  -2.957425 4.13936 -0.609284
C  -3.666071 -2.141385 2.343987
H  0.444964 2.245525 -0.194485
H  0.56121 -3.164257 0.526541
H  -0.663717 -2.42907 -0.545432
H  -0.695194 -0.274873 -2.452175
H  -1.70725 1.825171 1.604176
H  -3.579651 -1.198724 -0.969204
H  -2.148732 1.531504 -2.701305
H  -0.675331 -0.45077 2.16518
H  2.487735 3.553988 0.1919
H  5.064163 -0.690355 0.98518
H  1.268226 -1.559567 -2.784282
H  -0.154529 -2.607256 -3.167326
H  1.519668 -3.142501 -3.561851
H  -0.265193 -4.92466 -1.680141
H  1.10768 -5.114082 -0.530449
H  1.408333 -5.167774 -2.291852
H  4.918275 3.651344 0.798353
H  -2.684357 4.113626 1.554721
H  -5.024192 -2.440653 0.664852
H  -3.117081 3.835161 -2.760409
H  -2.111782 -1.676281 3.799585
H  6.196727 1.523602 1.198568
H  -3.395809 5.143356 -0.630123
H  -4.29331 -2.685143 3.059285
