program: Gaussian 09
title: 000261884
version: EM64L-G09RevD.01
frameworkgroup: C1[X(C6H9N3O)]
method: RPBEPBE
basis: SDD
operation: Freq
keyword: #pfreq=noraman
keyword: PBEPBE/SDD
title: #p freq=noraman PBEPBE/SDD
converged: YES YES NO NO
title: Mulliken charges:
elementType: O N N N C C C C C C H H H H H H H H H
charge: -0.298199 -0.397892 -0.403024 -0.505200 0.281811 0.091989 -0.340169 -0.248721 -0.738379 0.132043 0.228415 0.307940 0.254010 0.189959 0.261906 0.260671 0.320526 0.301161 0.301151
chargesum: 0.00000
title: Mulliken charges with hydrogens summed into heavy atoms:
elementType: O N N N C C C C C C
charge: -0.298199 -0.089952 -0.082498 0.097112 0.281811 0.091989 -0.111754 0.005289 -0.025842 0.132043
polarizability: 1.19223613e+02 -2.30818107e+00 9.75292774e+01 -5.38568187e-03 6.13281950e-03 4.64898480e+01
1716.lowfreq: -48.6375 -10.5861 -8.3731 -3.5803 -0.0002 0.0004 0.0008 18.6399 105.4973
frequency: -48.6012 18.3572 105.4963 129.0548 146.1716 212.1235 261.0183 263.3855 320.2088 411.2092 476.4449 514.2462 605.1399 627.0110 637.7622 670.9906 703.5583 761.5776 785.5669 837.2454 838.9965 897.6055 968.4379 1023.2274 1038.8472 1091.0176 1112.1969 1191.5066 1221.6596 1274.1923 1286.2708 1323.1985 1381.7962 1413.5309 1434.0762 1442.0023 1450.7176 1483.9812 1488.0669 1577.9525 1586.0675 1682.8649 2986.6646 3080.7481 3083.1386 3200.8622 3242.6135 3382.0957 3492.4814 3574.7124 3594.2417
redmass: 1.0345 3.3593 3.0772 1.3750 4.0764 3.4154 3.7165 4.0703 3.8305 6.0761 4.1463 1.2110 2.3594 1.3935 3.6090 4.7359 1.3228 4.8578 1.7262 1.4069 7.2967 4.8473 1.6935 2.4178 1.4579 1.7066 1.4914 3.5153 2.7449 1.9226 1.1547 2.4172 3.0259 1.2718 1.7775 1.0441 2.1785 1.9107 2.7232 5.0488 6.4654 1.0607 1.0375 1.0975 1.0988 1.0929 1.1045 1.0427 1.0980 1.0790 1.0811
irintensity: 0.0014 1.9860 3.4111 27.0302 1.1823 2.6461 0.0744 13.8068 20.6588 0.0355 2.7785 147.4415 22.2195 59.9671 0.5991 0.3755 141.5323 0.5708 105.2779 9.0451 60.0544 6.7048 14.0980 5.9359 5.7204 34.5622 1.5546 0.0962 11.0267 61.4098 0.0707 27.9479 23.0172 18.0870 22.4354 13.9004 229.0934 3.3806 23.0033 93.4501 171.0523 32.6637 34.0963 10.3681 21.4477 4.0275 1.8818 0.0572 0.6342 25.2443 49.4007
temp: 298.150 k
press: 1.00000 atm
elementType: 8 7 7 7 6 6 6 6 6 6 1 1 1 1 1 1 1 1 1
symmnumber: 1
zpe: 396755.5 jmol-1
zpe.correction: 0.151116 hartree
zpe.thermalcorrener: 0.160858 hartree
zpe.thermalcorrenthalpy: 0.161802 hartree
zpe.thermalcorrgfe: 0.114919 hartree
zpe.sumelectzpe: -472.750831 hartree
zpe.sumelectthermal: -472.741089 hartree
zpe.sumelectthermalent: -472.740145 hartree
zpe.sumelectthermalfe: -472.787028 hartree
dipole: 3.5814 -1.2900 0.0089
dipole: 3.8066
quadrupole: -46.4012 -58.1825 -60.7302
quadrupole: 0.9194 -0.0071 0.0213
quadrupole: 8.7034 -3.0779 -5.6255 0.9194 -0.0071 0.0213
hfenergy: -472.9019467 hartree
pointgroup: C01 [X(C6H9N3O1)]
dipole: 1.4431835 -0.4002031 0.0042139 debye
dipolederiv: -0.7671362 0.1952504 -0.0012072 0.1076104 -0.9603625 0.0036694 0.000375 0.0033975 -0.3653096 -0.6921867 -0.0913892 0.0002754 -0.012051 -0.2054067 0.0002552 -0.0002159 -0.0005736 -0.2387639 -0.5342847 -0.2987135 0.0023552 -0.6858597 -0.4719717 0.0006119 0.0051242 0.0012672 -0.4716944 -0.2204563 -0.1517764 0.0005556 -0.2726306 -0.3521266 0.0014094 0.0005617 0.0014394 -0.0319744 0.637676 0.073294 0.0002771 0.139133 0.2319956 -0.0000895 0.0001717 0.0018581 -0.0113295 -0.8573622 -0.040781 -0.0001482 0.0151469 -0.145483 0.0005123 -0.0004795 0.0002322 -0.0795309 0.046911 -0.074651 0.0003387 -0.1530284 -0.0043677 -0.0004634 0.0011838 -0.0003462 -0.2445927 -0.096439 0.19414 -0.0007906 0.1478808 0.0514532 -0.0009919 -0.0004584 -0.0006631 -0.2217972 0.1418546 0.0872988 -0.0017137 0.0136191 -0.1251724 0.0008479 -0.0025591 -0.0008919 0.037225 1.6987488 0.151633 -0.0017684 0.3071504 1.2523536 -0.0068488 -0.0028844 -0.0062839 0.2302924 0.0603686 -0.0965133 0.0002441 -0.0751202 -0.0276384 0.0004316 0.0000144 0.000477 0.1911986 0.2073971 -0.020071 0.0000739 -0.0211706 0.1736678 0.0003874 0.0003301 0.0003555 0.328053 -0.0047525 0.0748547 0.0000023 0.0581406 0.037577 0.0003819 -0.0000094 0.0003987 0.2303787 -0.1823139 -0.1480294 0.0025855 -0.032319 0.0286205 0.0002831 0.0022234 0.0011252 0.1144727 0.0702554 0.0302776 -0.0818882 0.0002013 0.0270325 0.0330256 -0.0602736 0.0750238 -0.0103728 0.0707893 0.0288319 0.080959 -0.0006264 0.0238179 -0.0341301 0.0595589 -0.0767959 -0.0138932 0.1100541 0.0577552 -0.000337 0.096241 0.1196914 0.0011651 -0.0010369 0.0007464 0.3465646 0.1553035 0.0143272 0.0453388 0.183634 0.1741009 0.1506396 0.0412248 0.0900957 0.1046201 0.1555729 0.014262 -0.0451524 0.1840484 0.1722185 -0.1510965 -0.0428509 -0.0908622 0.1064537 unknown
polarizability: 119.4470104|-0.6566979|97.3055149|-0.0231073|-0.1349121|46.4902136 unknown
InChI: InChI=1S/C6H9N3O/c1-4-5(2-3-8-4)6(10)9-7/h2-3,8-9H,7H2,1H3
charge 0 multiplicity 1
19 atoms
O  -1.587285 1.305496 -0.007785
N  2.476276 -0.119565 -0.000392
N  -2.117006 -0.953563 0.005971
N  -3.519264 -0.728048 0.003894
C  1.298932 0.621985 -0.001532
C  0.234057 -0.30763 0.000156
C  0.814259 -1.637219 0.003685
C  2.200386 -1.493071 0.002449
C  1.301887 2.12373 -0.003818
C  -1.188823 0.091853 -0.001204
H  0.291364 -2.593409 0.005647
H  3.407954 0.292906 -0.00167
H  2.993052 -2.237475 0.003462
H  2.33314 2.523681 -0.013128
H  0.757101 2.516369 -0.879413
H  0.772461 2.519776 0.879838
H  -1.831729 -1.931828 0.010991
H  -3.789926 -0.201571 -0.840185
H  -3.791335 -0.194617 0.843132
