program: Gaussian 09
title: 000261877
version: EM64L-G09RevD.01
frameworkgroup: C1[X(C10H11N3O)]
method: RPBEPBE
basis: SDD
operation: Freq
keyword: #p
keyword: freq=noraman
keyword: PBEPBE/SDD
title: #p freq=noraman PBEPBE/SDD
converged: YES YES NO NO
title: Mulliken charges:
elementType: O N N N C C C C C C C C C C H H H H H H H H H H H
charge: -0.253151 -0.375381 -0.500825 -0.015285 -0.609399 -0.205151 0.490332 -0.371260 -0.411619 0.184200 -0.229673 -0.224241 -0.236579 -0.184004 0.234460 0.269180 0.292596 0.236387 0.238105 0.229490 0.227257 0.230732 0.363651 0.309700 0.310479
chargesum: 0.00000
title: Mulliken charges with hydrogens summed into heavy atoms:
elementType: O N N N C C C C C C C C C C
charge: -0.253151 -0.011730 0.119355 -0.015285 -0.105760 0.087445 0.490332 -0.134873 -0.173515 0.184200 -0.000183 0.003017 -0.005847 -0.184004
polarizability: 1.65894021e+02 -5.59691760e+00 1.28969768e+02 1.14728889e+01 9.77964996e+00 7.71840345e+01
1716.lowfreq: -0.0006 -0.0006 -0.0003 5.3119 7.9744 12.2571 27.4384 32.2277 50.8215
frequency: 27.3410 32.2270 50.7974 74.8995 126.1458 130.9548 153.1201 171.7297 232.9547 261.2279 276.2298 343.6200 374.3826 403.7541 474.1147 490.5923 531.5528 562.2919 607.6983 617.9469 655.4506 706.3789 741.8107 752.1408 761.4232 828.3502 834.1323 855.9366 921.6386 933.1984 978.8914 988.7093 991.1120 997.9592 1027.5363 1036.6264 1085.8656 1134.7070 1161.0439 1174.2574 1190.8107 1219.7743 1223.7110 1267.3944 1285.3706 1294.5647 1315.3829 1333.1783 1383.4362 1442.3883 1457.2036 1480.3500 1486.3568 1594.1591 1615.2073 1623.4952 1676.0515 2180.6427 3002.3555 3014.4893 3078.9760 3115.9380 3123.2613 3135.1074 3147.8722 3164.9708 3400.9261 3520.4549 3528.2463
redmass: 5.8045 5.0867 4.8082 4.9221 1.8240 4.1789 2.2977 4.8814 5.0588 4.8012 4.3447 2.3125 6.7362 2.8224 4.5174 7.2983 4.5055 5.1933 1.8958 5.7760 1.7489 1.7834 4.7325 1.5640 2.1093 2.9276 4.1311 1.2493 1.7492 2.5711 1.3981 3.0964 4.8978 1.3216 2.2457 3.7750 1.5727 4.4080 1.1701 1.0524 1.1274 2.4380 1.3277 2.1433 1.1675 1.4062 1.4095 1.2522 7.7039 2.1672 1.5866 1.2227 1.9299 6.0378 6.1137 8.6532 1.0660 12.5264 1.0773 1.0637 1.1038 1.0878 1.0867 1.0911 1.0959 1.1015 1.0428 1.0993 1.0798
irintensity: 1.0995 0.7024 0.9166 0.8256 32.0946 7.2234 3.1873 0.5484 4.7575 16.0917 24.9128 1.2145 14.1744 0.0115 7.3284 3.2523 25.0797 7.6038 55.2520 2.1962 93.7368 61.4209 14.1759 125.8934 30.6796 3.6829 2.4141 0.0806 2.9678 8.9218 0.2790 4.7682 2.9290 0.0605 4.5401 0.9352 11.8203 22.5941 6.1310 0.2611 0.3079 5.0388 39.0685 30.2213 0.3957 0.6756 1.2934 0.6851 0.1669 7.3826 157.9434 18.8136 10.0996 4.2874 5.1389 206.9650 20.6105 11.9993 1.5547 11.1399 6.3068 6.6326 4.1243 11.8004 35.3704 20.6536 1.4850 3.6482 39.8955
temp: 298.150 k
press: 1.00000 atm
elementType: 8 7 7 7 6 6 6 6 6 6 6 6 6 6 1 1 1 1 1 1 1 1 1 1 1
symmnumber: 1
zpe: 513274.7 jmol-1
zpe.correction: 0.195496 hartree
zpe.thermalcorrener: 0.209191 hartree
zpe.thermalcorrenthalpy: 0.210135 hartree
zpe.thermalcorrgfe: 0.153087 hartree
zpe.sumelectzpe: -626.093549 hartree
zpe.sumelectthermal: -626.079854 hartree
zpe.sumelectthermalent: -626.078910 hartree
zpe.sumelectthermalfe: -626.135957 hartree
dipole: -0.2011 -1.2962 0.2228
dipole: 1.3305
quadrupole: -71.3654 -93.6255 -80.2199
quadrupole: -1.6289 2.0573 5.6808
quadrupole: 10.3715 -11.8886 1.5170 -1.6289 2.0573 5.6808
hfenergy: -626.2890446 hartree
pointgroup: C01 [X(C10H11N3O1)]
dipole: 0.1075497 -0.4116138 -0.3050147 debye
dipolederiv: -0.6754664 -0.1697459 -0.082867 0.0638647 -0.8352645 -0.2976269 0.0720935 -0.2955359 -0.5379412 -0.5527382 0.2101897 0.1720211 0.404607 -0.3537907 0.042213 0.2439673 0.0343422 -0.3958647 -0.3674206 0.09528 0.0629806 0.228422 -0.230317 -0.1183728 0.1078342 -0.117032 -0.1086725 -0.2529813 0.0373903 0.0186846 -0.0189269 -0.2838292 -0.0927607 -0.0185341 -0.0337409 -0.2638471 0.1960097 -0.0386908 -0.0566741 -0.0561133 0.0413498 -0.0785655 -0.1475621 -0.0492233 0.1751732 -0.3749103 -0.1404194 -0.0177204 -0.1487314 0.0012949 -0.126827 -0.0151245 -0.1372314 0.0683028 0.2805451 0.0006789 0.0115378 0.0482561 -0.0149977 0.0129696 0.0733359 0.005359 -0.1025084 -0.111979 -0.0854593 0.0290911 -0.0994722 0.0167006 -0.0149984 0.0104396 0.0128387 -0.1253114 -0.1493632 0.0469338 0.0380589 0.0393611 0.048995 0.0194794 0.0212512 0.0211989 -0.1471183 1.3168527 0.052988 0.0024293 -0.2119021 0.9471573 0.4693995 -0.0058894 0.4916866 0.4683041 -0.0281103 0.0676165 0.0334279 0.0819605 0.1096761 0.0133596 0.0363862 0.0232365 -0.1317083 -0.0029215 -0.0829652 0.0331114 -0.1025846 0.0756243 -0.0091629 0.0277112 -0.0133679 -0.1348169 0.0648821 0.0202496 0.0688779 0.0234626 -0.0721617 0.0084341 0.0567734 0.005345 -0.1470338 -0.122212 -0.0795745 -0.0336128 -0.0143292 0.1785352 0.1794379 0.0428273 0.1185422 0.0202503 -0.0118075 0.0299074 -0.0317062 0.0645343 -0.0226117 0.1139904 -0.0113934 0.0548069 0.0232385 0.0738647 0.0175814 -0.0018832 0.0005643 -0.0055566 -0.0775112 -0.0020666 -0.0463907 0.0389277 0.1169496 0.0362603 -0.0420021 0.0204866 0.0115978 0.0137418 -0.0643828 -0.0073621 0.0377788 0.0199163 0.102234 -0.0363231 0.1020841 -0.0156339 0.0105699 -0.0399892 0.0080546 0.1290572 0.0607742 -0.0952648 -0.0343296 -0.0824966 -0.0580719 -0.0156886 -0.0314351 -0.0264045 0.1358591 0.0439572 -0.0671393 -0.0189737 -0.0900256 -0.0831739 -0.0164733 -0.0324521 -0.0199412 0.1499212 0.0024962 0.0944114 -0.0274621 0.1103396 -0.0520126 0.0171051 -0.0353513 0.0159873 0.1502385 -0.1205187 -0.0202789 -0.0602741 -0.0210682 0.0864395 -0.0059913 -0.0661375 -0.0059088 0.1468081 0.1767442 -0.017347 -0.023439 -0.0547302 0.2176351 -0.0727813 -0.0504637 -0.069579 0.2898835 0.2181237 0.0313869 -0.0710016 -0.1144941 0.0590784 0.0885341 -0.1510891 0.0298915 0.2179526 0.1993133 -0.0462232 0.0680485 -0.1730686 0.2333375 -0.0624746 -0.0207488 0.000428 0.043127 unknown
polarizability: 166.3531842|4.860278|127.36707|6.9365851|15.0690625|78.3275692 unknown
InChI: InChI=1S/C10H11N3O/c11-7-9(10(14)13-12)6-8-4-2-1-3-5-8/h1-5,9,13H,6,12H2
charge 0 multiplicity 1
25 atoms
O  -2.449266 -2.202499 -0.623071
N  -3.420016 -0.40492 0.49095
N  -4.76064 -0.778256 0.209642
N  -0.984003 1.674943 1.823468
C  -0.02917 -0.492996 -0.841933
C  -0.92537 -0.607614 0.446625
C  1.446639 -0.324271 -0.517814
C  2.020331 0.963691 -0.36431
C  2.272099 -1.464873 -0.340552
C  -2.33566 -1.142385 0.056983
C  3.387697 1.109279 -0.039129
C  3.639646 -1.322816 -0.015768
C  4.201411 -0.033635 0.136554
C  -0.953108 0.648289 1.213796
H  -0.400642 0.349093 -1.453581
H  -0.207298 -1.425428 -1.406058
H  -0.477176 -1.391898 1.089072
H  1.39485 1.854976 -0.496794
H  1.843038 -2.466981 -0.468884
H  3.816475 2.110899 0.076388
H  4.266217 -2.212636 0.11216
H  5.262332 0.078678 0.386319
H  -3.302909 0.452888 1.03588
H  -4.980296 -1.689486 0.63567
H  -4.922882 -0.803344 -0.806812
