program: Gaussian 09
title: 000261931
version: EM64L-G09RevD.01
frameworkgroup: C1[X(C18H20N2O2)]
method: RPBEPBE
basis: SDD
operation: Freq
keyword: #p
keyword: freq=noraman
keyword: PBEPBE/SDD
title: #p freq=noraman PBEPBE/SDD
converged: YES YES NO NO
title: Mulliken charges:
elementType: O O N N C C C C C C C C C C C C C C C C C C H H H H H H H H H H H H H H H H H H H H
charge: -0.260554 -0.279688 -0.456190 -0.462819 0.297083 -0.237821 -0.522670 -0.476599 -0.433873 0.229963 0.327934 0.317385 -0.023392 0.489457 -0.465065 -0.482156 -0.497120 -0.500992 -0.206330 -0.210932 -0.267337 -0.658977 0.289907 0.262272 0.215517 0.244355 0.227056 0.191810 0.236898 0.283903 0.309425 0.219292 0.233946 0.233604 0.234306 0.217354 0.218725 0.238795 0.220338 0.208759 0.233194 0.261238
chargesum: 0.00000
title: Mulliken charges with hydrogens summed into heavy atoms:
elementType: O O N N C C C C C C C C C C C C C C C C C C
charge: -0.260554 -0.279688 -0.172287 -0.153394 0.297083 0.052087 -0.044881 -0.005188 -0.005165 0.229963 0.327934 0.317385 -0.023392 0.489457 -0.245773 -0.248210 -0.263517 -0.266687 0.011024 0.007793 0.191796 0.044214
polarizability: 2.52824906e+02 -2.14138619e+01 2.23984007e+02 2.35717334e+01 3.42756828e+01 1.71124442e+02
1716.lowfreq: -17.8744 -13.1865 -10.2674 -0.0008 -0.0006 0.0005 4.1911 18.6292 42.1737
frequency: -16.8058 17.5459 42.1097 46.9296 63.1313 89.6004 146.9199 159.5668 181.4298 197.2366 222.5703 238.5014 244.8218 257.7420 293.6972 315.9579 330.4914 342.7171 417.4913 421.2114 433.2062 443.0746 468.5550 476.9345 495.7743 500.6270 529.0902 541.0209 566.2325 596.2933 633.8830 639.9673 642.1908 673.4980 682.9526 729.5429 752.3621 760.1135 779.6688 786.3578 799.4344 819.9359 823.1362 828.9555 849.0546 852.0763 880.1481 886.7804 903.7075 920.3006 958.1736 967.5678 970.8016 981.4773 1012.9422 1035.6962 1037.9373 1046.1015 1068.3762 1077.3630 1097.1655 1097.8047 1117.2040 1130.7392 1153.6896 1157.8984 1167.7322 1179.5776 1198.5630 1206.6525 1228.5121 1232.1058 1269.9859 1272.8422 1286.9955 1296.7168 1304.0706 1306.5301 1313.1145 1325.5791 1355.8416 1371.2024 1394.5819 1411.9407 1418.7356 1442.0138 1449.2917 1453.4467 1460.2573 1461.9980 1464.6908 1469.6569 1483.8562 1485.0362 1503.8190 1530.8538 1592.0067 1607.2839 1613.9225 1631.8591 2980.6119 2991.3101 3004.0357 3007.1932 3027.5880 3057.0884 3066.2709 3081.2199 3088.0266 3089.0474 3090.1448 3114.8178 3116.4712 3118.0670 3131.0651 3133.0787 3152.1218 3154.4776 3527.4338 3559.5264
redmass: 2.9654 3.9984 4.0088 5.4325 4.2687 3.7295 3.0452 3.9688 2.0465 3.1770 2.3512 2.5927 3.6602 3.7676 2.1176 3.0421 3.9547 4.1956 3.8095 1.7644 2.7805 2.9646 3.4700 5.2088 2.7979 3.6439 5.2268 2.1206 2.1912 3.9790 3.8801 3.4833 3.5025 4.4659 4.5467 3.7766 1.3153 1.6467 5.1501 2.3003 2.9197 1.5606 2.9978 3.7380 1.4818 2.5768 1.6034 1.9086 2.5119 2.9946 1.3128 1.3500 2.4590 2.2761 2.7769 2.3358 3.3098 2.3484 2.7524 1.9272 1.9912 2.2360 2.2887 1.8516 1.7147 1.7296 1.5459 1.2292 1.4226 1.8435 1.4468 1.7885 1.4587 1.1294 1.5568 1.9383 1.3197 1.5490 1.6390 1.4335 1.4374 3.2241 1.2264 2.0018 4.7330 6.8368 1.9007 1.0944 1.0879 2.3222 1.1449 1.0871 1.0570 1.1389 1.6704 4.2569 5.0036 7.8369 7.5262 6.4407 1.0680 1.0363 1.0635 1.0613 1.0581 1.0902 1.0947 1.1005 1.0985 1.1033 1.1020 1.1058 1.0862 1.0856 1.0907 1.0910 1.0995 1.0988 1.0762 1.0765
irintensity: 0.9411 0.5876 1.1490 1.9761 0.4201 0.1608 1.1840 3.0709 2.8488 2.9046 4.5646 5.4214 0.1590 16.9006 0.7218 1.4223 13.7563 5.3071 1.0664 39.5441 9.1073 34.3642 1.2755 7.3089 1.4620 23.5828 6.9851 95.1064 8.6682 14.6737 9.4239 3.0398 0.9564 6.3077 3.1762 14.2458 1.2395 106.6434 7.4073 4.3828 67.2833 0.8024 72.4685 9.1498 2.1712 3.0947 5.9379 1.3540 0.5571 19.2374 0.0168 3.2119 39.0569 7.2648 39.2043 56.5511 13.9930 15.6809 50.9434 6.3797 6.6544 52.9459 161.1025 3.5320 28.8736 28.7728 18.1437 8.9155 1.4145 12.1485 0.8632 4.4486 21.0051 3.2532 5.1511 2.7819 21.3653 6.2133 7.3854 52.1000 31.9654 15.0703 12.7651 2.9829 135.8973 56.2814 15.6770 19.5910 19.5215 5.1626 11.5728 11.0652 23.3853 21.5814 81.2611 0.5619 23.2826 103.1646 441.2188 43.2068 35.7248 17.0799 16.3339 24.9397 41.2446 14.6121 31.8259 25.4711 25.9976 9.1547 24.9956 22.7962 9.5639 8.3305 15.2659 17.6867 43.9130 27.7508 33.1800 19.0232
temp: 298.150 k
press: 1.00000 atm
elementType: 8 8 7 7 6 6 6 6 6 6 6 6 6 6 6 6 6 6 6 6 6 6 1 1 1 1 1 1 1 1 1 1 1 1 1 1 1 1 1 1 1 1
symmnumber: 1
zpe: 905072.8 jmol-1
zpe.correction: 0.344724 hartree
zpe.thermalcorrener: 0.363087 hartree
zpe.thermalcorrenthalpy: 0.364031 hartree
zpe.thermalcorrgfe: 0.297893 hartree
zpe.sumelectzpe: -956.304010 hartree
zpe.sumelectthermal: -956.285648 hartree
zpe.sumelectthermalent: -956.284704 hartree
zpe.sumelectthermalfe: -956.350841 hartree
dipole: 2.6580 -0.5543 -1.4105
dipole: 3.0597
quadrupole: -127.3774 -114.7193 -130.0293
quadrupole: -9.0113 1.1186 2.9598
quadrupole: -3.3354 9.3227 -5.9873 -9.0113 1.1186 2.9598
hfenergy: -956.6487344 hartree
pointgroup: C01 [X(C18H20N2O2)]
dipole: -1.0698233 -0.3406326 -0.4341619 debye
polarizability: 258.1418063|-25.0816025|157.8756527|-1.7357959|-23.8720745|231.915896 unknown
InChI: InChI=1S/C18H20N2O2/c1-2-22-17(21)13-8-5-11-18(13)19-14-9-3-6-12-7-4-10-15(20-18)16(12)14/h3-4,6-7,9-10,13,19-20H,2,5,8,11H2,1H3
charge 0 multiplicity 1
42 atoms
O  -1.331134 -2.434928 0.368979
O  -2.297656 -0.885819 1.82972
N  -0.5506 1.478356 -1.498118
N  -0.551847 1.256132 0.865424
C  -1.38216 1.135113 -0.335515
C  -2.05192 -0.340026 -0.556342
C  -2.612033 2.078045 -0.274011
C  -3.554637 -0.060528 -0.899757
C  -3.637905 1.451564 -1.239771
C  -1.925792 -1.214378 0.670889
C  0.781682 1.054309 -1.60395
C  0.786053 0.830878 0.872413
C  1.47292 0.717159 -0.387586
C  2.86016 0.328063 -0.427772
C  1.460729 0.998307 -2.835354
C  1.475973 0.557536 2.06947
C  3.522338 0.270735 -1.699548
C  3.529861 0.040682 0.80807
C  2.830932 0.606955 -2.868771
C  2.844804 0.163811 2.022668
C  -1.052431 -3.374082 1.50442
C  0.439168 -3.328479 1.842947
H  -1.532298 -0.834395 -1.392718
H  -2.320249 3.11424 -0.510747
H  -3.02016 2.058071 0.75463
H  -4.177587 -0.261819 -0.008894
H  -3.914078 -0.708265 -1.717424
H  -3.358995 1.637083 -2.296652
H  -4.655917 1.853908 -1.100453
H  -1.050104 1.718925 -2.354399
H  -1.070026 1.171166 1.743098
H  0.940214 1.256463 -3.765508
H  0.962104 0.650298 3.03335
H  4.575687 -0.027846 -1.73967
H  4.582843 -0.261258 0.788097
H  3.344525 0.567349 -3.836331
H  3.364519 -0.046236 2.964807
H  -1.682496 -3.081167 2.362167
H  -1.361898 -4.360646 1.121805
H  0.660869 -4.056942 2.645334
H  1.051704 -3.58454 0.961724
H  0.738138 -2.324393 2.188682
