program: Gaussian 09
title: 000261857
version: EM64L-G09RevD.01
frameworkgroup: C1[X(C3H3N3O2S)]
method: RPBEPBE
basis: SDD
operation: Freq
keyword: #p
keyword: freq=noraman
keyword: PBEPBE/SDD
title: #p freq=noraman PBEPBE/SDD
converged: YES YES YES YES
title: Mulliken charges:
elementType: S O O N N N C C C H H H
charge: 0.366778 -0.144052 -0.191429 -0.047183 0.036849 0.112804 -0.060873 -0.161380 -0.695819 0.254477 0.254468 0.275359
chargesum: 0.00000
title: Mulliken charges with hydrogens summed into heavy atoms:
elementType: S O O N N N C C C
charge: 0.366778 -0.144052 -0.191429 -0.047183 0.036849 0.112804 -0.060873 -0.161380 0.088485
polarizability: 1.16099708e+02 -1.80158756e+00 8.46582005e+01 2.65161430e-04 -9.92394336e-05 3.46860828e+01
1716.lowfreq: -4.9574 -0.0023 -0.0021 0.0015 3.4615 7.0973 51.9855 97.1994 118.3260
frequency: 51.9460 97.1876 118.3242 169.6369 295.2602 311.1875 344.2641 445.8522 487.6216 545.0236 579.1385 598.5510 683.0875 705.8882 755.3524 939.6567 1003.5440 1034.2661 1046.0401 1153.0107 1201.1005 1364.8458 1384.4690 1395.6778 1405.6823 1451.8202 1468.1287 2998.2328 3081.6035 3121.6641
redmass: 11.9566 1.1724 3.5004 7.7237 5.5986 3.9477 12.1840 13.3373 7.3665 5.6992 9.5427 12.3808 13.6856 11.6488 12.0984 2.7495 10.7897 1.4344 4.4130 3.9435 10.1603 11.5598 12.2540 1.3465 3.0004 1.0433 1.2652 1.0370 1.0979 1.0992
irintensity: 1.8553 0.1342 0.0011 2.5564 6.1294 3.8832 0.4313 0.4695 0.0633 13.8244 0.1772 0.5277 3.9701 27.4434 28.9297 11.5871 12.2672 3.7337 22.9711 33.8451 187.5503 91.9199 103.2956 2.0844 68.1078 23.4827 14.8543 1.6888 5.2867 2.0085
temp: 298.150 k
press: 1.00000 atm
elementType: 16 8 8 7 7 7 6 6 6 1 1 1
symmnumber: 1
zpe: 180863.8 jmol-1
zpe.correction: 0.068887 hartree
zpe.thermalcorrener: 0.077375 hartree
zpe.thermalcorrenthalpy: 0.078319 hartree
zpe.thermalcorrgfe: 0.034452 hartree
zpe.sumelectzpe: -828.074950 hartree
zpe.sumelectthermal: -828.066462 hartree
zpe.sumelectthermalent: -828.065518 hartree
zpe.sumelectthermalfe: -828.109385 hartree
dipole: 5.4609 -2.6250 0.0002
dipole: 6.0590
quadrupole: -57.4198 -67.5495 -56.5646
quadrupole: -3.5210 -0.0007 -0.0004
quadrupole: 3.0915 -7.0382 3.9467 -3.5210 -0.0007 -0.0004
hfenergy: -828.1438376 hartree
pointgroup: C01 [X(C3H3N3O2S1)]
dipole: -2.083625 -1.1580241 -0.0009303 debye
dipolederiv: -0.1846813 0.0284997 -0.0000831 0.0544618 -0.3510936 -0.0001373 -0.0000612 -0.0001608 0.2134036 -0.6960431 -0.2408939 -0.000192 -0.1544338 -0.5408922 -0.0000892 -0.0002194 -0.0001767 -0.174297 -0.6124601 0.1207944 -0.0000857 0.0797674 -0.6233222 -0.0000805 -0.0001137 -0.00002 -0.2168033 -0.596867 0.085687 -0.0001048 -0.4193678 -0.354948 -0.000181 -0.0001986 -0.0000154 -0.1547498 0.1926005 -0.1007226 0.0000569 -0.2055409 -0.3599661 -0.0001452 0.0000576 -0.0000935 -0.0785859 1.6418003 0.1019263 0.0004388 -0.0880842 1.0008825 0.0001131 0.0004122 0.0001943 0.2115225 0.810237 -0.1262508 0.000156 0.1861392 0.5610464 0.0002394 0.0002755 0.0001382 -0.054822 -0.4083721 0.170161 -0.0000806 0.6074203 0.5392774 0.0003233 -0.0000029 0.0001761 0.0487931 -0.3123225 -0.0632859 -0.0001085 -0.1340946 -0.0248062 -0.000064 -0.0002352 -0.0000575 0.053006 0.0606813 -0.0009018 0.0026613 -0.0074697 0.0754411 -0.0946488 -0.0360931 -0.0849901 0.0045546 0.0606855 -0.000915 -0.0026574 -0.0075222 0.07527 0.0947236 0.0361411 0.0850611 0.0047366 0.0447414 0.0259014 -0.0000009 0.0887246 0.0031108 -0.0000536 0.000038 -0.0000557 0.1432415 unknown
polarizability: 115.7769021|3.6456542|84.980997|0.023736|0.0133003|34.6860927 unknown
InChI: InChI=1S/C3H3N3O2S/c1-2-4-5-3(9-2)6(7)8/h1H3
charge 0 multiplicity 1
12 atoms
S  -0.560837 -1.391692 -0.000838
O  2.708405 0.961038 0.000755
O  2.40933 -1.313668 0.000203
N  -1.485518 1.126319 -0.000409
N  -0.089679 1.248987 -0.000031
N  1.98033 -0.091932 0.000243
C  -1.909358 -0.148738 -0.000796
C  0.515238 0.070279 -0.000126
C  -3.353365 -0.534337 -0.001236
H  -3.611314 -1.132539 -0.893424
H  -3.611643 -1.13341 0.890269
H  -3.96359 0.382493 -0.000913
