program: Gaussian 09
title: 000261965
version: EM64L-G09RevD.01
frameworkgroup: C1[X(C16H26N2O4)]
method: RPBEPBE
basis: SDD
operation: Freq
keyword: #p
keyword: freq=noraman
keyword: PBEPBE/SDD
title: #p freq=noraman PBEPBE/SDD
converged: YES YES NO NO
title: Mulliken charges:
elementType: O O O O N N C C C C C C C C C C C C C C C C H H H H H H H H H H H H H H H H H H H H H H H H H H
charge: -0.307940 -0.312799 -0.288265 -0.290021 -0.353836 -0.358646 -0.046274 -0.031117 -0.396973 -0.408688 0.200992 0.205339 0.099197 0.104589 -0.706274 -0.699100 -0.687486 -0.696127 -0.020343 -0.021716 -0.524832 -0.524578 0.254872 0.193419 0.245644 0.211046 0.216235 0.264312 0.342487 0.334793 0.199117 0.219665 0.228975 0.200830 0.219249 0.218658 0.225663 0.209517 0.225750 0.212475 0.220123 0.210140 0.276027 0.205473 0.223547 0.277320 0.223114 0.206446
chargesum: 0.00000
title: Mulliken charges with hydrogens summed into heavy atoms:
elementType: O O O O N N C C C C C C C C C C C C C C C C
charge: -0.307940 -0.312799 -0.288265 -0.290021 -0.011349 -0.023852 0.208598 0.162302 0.059718 0.071858 0.200992 0.205339 0.099197 0.104589 -0.058517 -0.060362 -0.026556 -0.053390 -0.020343 -0.021716 0.180214 0.182302
polarizability: 3.11503875e+02 2.41458228e+01 2.26170999e+02 2.89542448e+01 1.45475309e+01 1.47328031e+02
1716.lowfreq: -17.1450 -6.5677 0.0005 0.0007 0.0007 1.9990 11.8362 22.9316 33.2156
frequency: 9.5294 22.2346 33.0054 37.7001 43.8405 52.0819 63.2639 75.0269 92.4683 98.0859 105.5803 153.8969 162.7422 179.4034 189.8089 194.3029 201.1692 206.3615 218.4768 234.3998 247.4358 250.3114 264.7641 276.1060 289.7312 301.2313 311.3657 353.5966 368.5950 374.8167 387.5364 410.1692 413.5640 422.2875 439.9864 455.9963 498.7784 518.9892 541.7885 551.2126 606.4538 640.9202 718.7580 773.7918 785.2534 795.3632 807.4979 816.0554 825.7675 833.2858 875.5427 888.5723 909.7174 915.2468 916.7422 930.8118 937.5011 956.9120 961.5511 973.8821 1029.3417 1030.5339 1088.4987 1091.1103 1109.5072 1110.1607 1131.6191 1133.8719 1157.3953 1157.9550 1162.2368 1170.8389 1176.6221 1177.0775 1255.7017 1261.2423 1268.2271 1273.6521 1298.5401 1308.5159 1310.6259 1319.2748 1335.1377 1339.1161 1350.8535 1353.0077 1374.7100 1379.9044 1393.3007 1399.7168 1421.5130 1422.8860 1448.9819 1449.2218 1451.6807 1456.1382 1466.2732 1468.3511 1470.3558 1471.4233 1480.3940 1481.7534 1484.3841 1487.5057 1488.0949 1488.5248 1490.9544 1493.7567 1549.7192 1559.5798 1622.4300 1626.5558 2959.6853 2967.0407 2967.7987 2969.6346 2970.2698 2971.3168 2978.8924 2982.7542 2995.3013 3011.8807 3058.9682 3063.9273 3067.7271 3072.7982 3073.7939 3076.5296 3078.5639 3078.8840 3080.9732 3081.6250 3094.9926 3108.1321 3121.2451 3122.9392 3316.0145 3339.2754
redmass: 4.0692 3.6027 3.3676 3.4138 2.8164 2.6330 3.5336 3.5866 2.4684 3.8564 5.1908 1.3636 1.2936 2.0949 2.3062 2.9859 1.3209 1.1128 1.6708 1.2884 1.9063 3.1587 3.8763 3.2237 2.9989 3.3502 7.1494 3.3938 3.2947 4.0732 3.4384 2.5208 1.9033 3.6227 7.6716 5.6427 3.8164 5.3356 5.1244 5.9939 6.8058 7.7328 11.1874 3.0871 1.6620 2.3133 3.5717 2.1341 1.5422 5.0819 1.9838 3.3401 1.6758 1.2289 1.2809 1.8678 1.6530 1.6185 1.5324 3.3955 3.9744 3.4838 5.2517 4.6436 1.2611 1.2622 2.3217 2.4004 1.5071 1.5065 2.1918 2.1612 1.8710 1.8843 2.4245 1.5509 2.0918 1.4224 1.4146 5.2525 1.2440 3.1864 1.3564 1.4317 1.3368 1.3876 1.2202 1.2146 1.2202 1.2115 1.2021 1.1962 1.0817 1.0659 1.1375 1.0837 1.0470 1.0534 1.0827 1.0546 1.1110 1.1116 1.2940 1.1794 1.1372 1.0627 2.0825 1.4765 2.3061 2.7280 9.9240 10.1432 1.0837 1.0348 1.0360 1.0347 1.0368 1.0361 1.0393 1.0640 1.0699 1.0788 1.0987 1.0998 1.0974 1.0998 1.1001 1.0987 1.0969 1.0992 1.0990 1.0972 1.0986 1.0950 1.1049 1.1051 1.0743 1.0750
irintensity: 0.8334 0.0796 0.1302 0.0774 0.2231 0.2572 2.7465 3.0993 0.9804 8.3480 0.2237 0.3220 0.0778 1.4179 0.7801 1.9861 0.6763 0.2451 0.0469 0.0809 1.5999 3.3297 0.6931 5.3446 2.9047 6.2908 1.0639 0.0395 2.2322 0.3468 26.8039 4.3230 1.6407 1.8931 0.0945 0.0095 19.5129 16.0492 7.1282 3.9503 9.8232 17.2142 3.1095 9.7620 63.2472 6.5664 1.1630 62.2694 32.4157 41.6537 10.3814 7.3683 5.1372 7.8755 10.2349 11.5320 1.1948 11.6555 1.7549 97.4362 63.5773 6.8269 5.7527 147.8104 12.0038 4.0715 0.8571 0.6728 21.1302 11.7714 18.9880 32.8913 14.1710 5.2969 12.5767 25.8874 97.7877 33.6628 8.9847 37.6980 4.4138 0.9313 4.6220 16.0842 12.6241 0.9867 23.5185 11.2820 32.8507 17.9885 10.8511 58.6113 46.2590 34.7832 131.0047 8.2628 3.6713 2.8272 43.2370 5.7905 51.4577 113.1767 190.4202 26.0054 16.6259 28.4478 24.5415 367.8876 1.4448 138.6010 369.5933 24.1100 25.7743 82.8857 44.8919 57.7468 41.6400 34.8585 39.0164 59.0691 34.4165 26.6821 10.7892 36.3174 71.1958 15.4369 7.5398 62.5447 40.4986 77.0397 26.2382 43.9929 16.2209 9.1782 14.1890 12.1831 65.9431 120.3561
temp: 298.150 k
press: 1.00000 atm
elementType: 8 8 8 8 7 7 6 6 6 6 6 6 6 6 6 6 6 6 6 6 6 6 1 1 1 1 1 1 1 1 1 1 1 1 1 1 1 1 1 1 1 1 1 1 1 1 1 1
symmnumber: 1
zpe: 1054274.9 jmol-1
zpe.correction: 0.401552 hartree
zpe.thermalcorrener: 0.427338 hartree
zpe.thermalcorrenthalpy: 0.428283 hartree
zpe.thermalcorrgfe: 0.343138 hartree
zpe.sumelectzpe: -1033.945722 hartree
zpe.sumelectthermal: -1033.919936 hartree
zpe.sumelectthermalent: -1033.918992 hartree
zpe.sumelectthermalfe: -1034.004137 hartree
dipole: -0.1361 -0.1231 -0.1633
dipole: 0.2456
quadrupole: -110.4275 -135.8555 -134.0004
quadrupole: 0.3565 7.8710 -9.8438
quadrupole: 16.3336 -9.0944 -7.2393 0.3565 7.8710 -9.8438
hfenergy: -1034.3472744 hartree
pointgroup: C01 [X(C16H26N2O4)]
dipole: -0.051651 0.0258079 0.0774815 debye
polarizability: 309.4040855|-8.5266193|210.9684506|-42.6143917|31.9407266|164.6303685 unknown
InChI: InChI=1S/C16H26N2O4/c1-9(2)7-17-11-13(19)16(22-6)12(18-8-10(3)4)14(20)15(11)21-5/h9-10,17-18H,7-8H2,1-6H3
charge 0 multiplicity 1
48 atoms
O  2.07033 2.002678 0.36885
O  -2.049886 -1.955111 -0.57732
O  -0.579731 2.177812 1.49572
O  0.599769 -2.121954 -1.706052
N  2.497669 -0.385936 -1.297427
N  -2.481551 0.448714 1.087718
C  4.578891 -0.086328 0.11004
C  -4.846419 0.59376 0.228685
C  3.815912 0.260739 -1.200849
C  -3.799152 -0.203898 1.060649
C  1.330437 -0.065785 -0.676515
C  -1.317106 0.120672 0.466285
C  1.044679 1.0622 0.105595
C  -1.028617 -1.008573 -0.315735
C  4.817047 -1.606425 0.249943
C  5.909007 0.699577 0.14385
C  -4.428635 0.685664 -1.255926
C  -6.231231 -0.076678 0.38727
C  -0.247487 1.19667 0.724001
C  0.263163 -1.141247 -0.935003
C  1.734084 3.420221 0.103465
C  -1.701994 -3.373765 -0.326167
H  3.945158 0.262792 0.948328
H  -4.907311 1.622422 0.645022
H  3.693625 1.353119 -1.262135
H  4.409561 -0.079785 -2.071557
H  -4.159507 -0.292881 2.105354
H  -3.683351 -1.211803 0.636093
H  2.411143 -1.280212 -1.812198
H  -2.386982 1.343948 1.602791
H  5.454691 -1.985535 -0.573094
H  5.328379 -1.835617 1.202639
H  3.866269 -2.170215 0.236124
H  6.563775 0.411918 -0.702155
H  6.46092 0.493472 1.078937
H  5.734061 1.790171 0.088467
H  -4.324052 -0.32433 -1.69412
H  -5.18349 1.242691 -1.840809
H  -3.459129 1.202217 -1.372319
H  -6.213101 -1.110519 -0.007356
H  -7.002316 0.482749 -0.172575
H  -6.5456 -0.120455 1.447322
H  0.9214 3.750101 0.770599
H  1.43871 3.558052 -0.955564
H  2.660535 3.977473 0.313105
H  -0.899018 -3.694136 -1.009025
H  -2.629471 -3.933842 -0.523464
H  -1.38838 -3.516009 0.72671
