program: Gaussian 09
title: 000261880
version: EM64L-G09RevD.01
frameworkgroup: C1[X(C16H15NO3)]
method: RPBEPBE
basis: SDD
operation: Freq
keyword: #p
keyword: freq=noraman
keyword: PBEPBE/SDD
title: #p freq=noraman PBEPBE/SDD
converged: YES YES NO NO
title: Mulliken charges:
elementType: O O O N C C C C C C C C C C C C C C C C H H H H H H H H H H H H H H H
charge: -0.278926 -0.234794 -0.240406 -0.438763 -0.469258 0.463375 0.086934 0.301354 -0.349775 -0.411228 0.341279 -0.325383 -0.380389 -0.331388 -0.341016 -0.245841 -0.228341 -0.220799 0.252562 -0.752585 0.243616 0.243574 0.335082 0.232413 0.227902 0.296003 0.249725 0.243585 0.278746 0.235366 0.237487 0.237637 0.249307 0.243608 0.249336
chargesum: 0.00000
title: Mulliken charges with hydrogens summed into heavy atoms:
elementType: O O O N C C C C C C C C C C C C C C C C
charge: -0.278926 -0.234794 -0.240406 -0.103680 0.017932 0.463375 0.086934 0.301354 -0.117362 -0.183326 0.341279 -0.029380 -0.130664 -0.087803 -0.062269 -0.010475 0.009146 0.016838 0.252562 -0.010335
polarizability: 3.46346078e+02 -2.56617370e+00 1.98301387e+02 8.83731620e-02 5.48640577e-03 8.25643373e+01
1716.lowfreq: -4.1293 -3.1377 -0.0010 -0.0005 0.0007 1.7980 21.2593 24.3747 36.9742
frequency: 21.1940 24.2845 36.9352 40.7117 48.3109 56.9127 84.7172 124.8743 134.6922 174.6224 175.8284 192.5118 194.8266 291.4978 326.6020 342.9440 366.0830 397.8357 413.8462 421.9680 429.4420 494.3234 515.1298 529.3315 552.7206 555.2623 592.3306 612.3593 615.8144 627.9963 662.4648 693.5551 713.0700 729.0997 769.7790 778.3211 808.8537 824.6568 856.0026 862.1060 889.6706 936.6502 945.3641 961.3335 984.0625 989.1869 990.1306 992.9996 993.0518 1001.8641 1012.9766 1027.8547 1036.9606 1088.1806 1115.1951 1151.9905 1160.1312 1175.5258 1189.2415 1192.5220 1197.9665 1203.0185 1233.8509 1281.8463 1308.6174 1319.4218 1347.2061 1374.4259 1381.5162 1389.7466 1423.1490 1437.6406 1452.6384 1454.5966 1458.9413 1473.5862 1487.0559 1516.4354 1566.2289 1583.4825 1601.0977 1612.3781 1632.1734 1646.4074 2904.2682 2934.2312 3007.0576 3095.3024 3128.5994 3132.4094 3140.6413 3142.5100 3146.6421 3151.3016 3161.1558 3165.4170 3171.9616 3205.5508 3504.5073
redmass: 2.4620 3.4175 1.9667 5.6339 3.9139 3.6497 4.2529 5.4383 3.9910 7.6173 4.6884 4.6467 3.2858 6.8863 5.0185 4.8949 6.4456 2.7901 3.0643 3.2103 6.0537 5.0482 2.4214 4.6188 2.1572 1.6158 1.8756 6.4083 6.5213 6.5491 6.4996 1.8018 3.3277 6.7033 1.6806 5.8483 1.2697 1.7808 1.2526 4.2955 7.2788 1.3902 1.3472 1.3232 4.9214 1.6324 5.6867 2.4916 1.6404 2.0875 1.3872 2.0181 1.6251 1.5806 1.4185 2.2896 3.0637 1.0697 2.5323 1.3914 1.4358 1.0814 1.9517 1.8711 1.4762 1.3581 1.9576 4.2335 1.2503 9.1762 3.5155 2.3031 1.0684 1.0470 1.3220 1.7718 1.7823 3.4840 7.0778 5.8913 6.2352 6.2852 6.7617 8.9263 1.0575 1.0989 1.0366 1.0975 1.0891 1.0852 1.0879 1.1010 1.0897 1.0924 1.0963 1.0956 1.1015 1.0943 1.0763
irintensity: 2.6663 1.9870 0.0584 1.7246 0.2901 0.2046 3.1712 1.0538 1.5734 3.0108 0.0768 3.6286 8.1281 26.1143 4.8774 5.2696 0.0236 0.0836 0.6608 3.5103 0.1418 4.9184 18.4621 10.3167 9.5915 33.3239 69.5071 0.6112 8.4852 13.0529 0.0420 50.7135 0.8687 7.9730 58.2638 1.8204 0.2729 101.4338 0.4408 7.5954 37.2858 1.3368 1.8840 3.7653 99.2013 0.0765 20.2866 9.3763 0.8358 102.0754 0.3738 2.1398 9.2546 7.1324 19.7594 61.4029 36.9419 6.3134 558.0820 71.1325 103.2694 1.7559 60.7939 50.8002 24.9425 0.3381 91.8881 19.8548 47.8513 5.2951 23.0277 17.2496 22.1676 17.9192 44.0281 25.9868 17.1182 542.0511 97.9825 11.0873 41.1806 22.5493 258.7755 179.2396 116.7628 24.2932 4.2801 8.6796 14.8679 1.1075 4.2048 11.8529 30.6648 16.4304 16.9798 6.2160 21.6347 3.1830 163.6248
temp: 298.150 k
press: 1.00000 atm
elementType: 8 8 8 7 6 6 6 6 6 6 6 6 6 6 6 6 6 6 6 6 1 1 1 1 1 1 1 1 1 1 1 1 1 1 1
symmnumber: 1
zpe: 713594.5 jmol-1
zpe.correction: 0.271794 hartree
zpe.thermalcorrener: 0.290338 hartree
zpe.thermalcorrenthalpy: 0.291282 hartree
zpe.thermalcorrgfe: 0.221460 hartree
zpe.sumelectzpe: -897.708445 hartree
zpe.sumelectthermal: -897.689900 hartree
zpe.sumelectthermalent: -897.688956 hartree
zpe.sumelectthermalfe: -897.758778 hartree
dipole: -3.4850 0.9154 0.0437
dipole: 3.6034
quadrupole: -85.1698 -116.3389 -121.7860
quadrupole: -19.2780 0.2094 0.1461
quadrupole: 22.5951 -8.5740 -14.0211 -19.2780 0.2094 0.1461
hfenergy: -897.9802384 hartree
pointgroup: C01 [X(C16H15N1O3)]
dipole: -1.3825887 -0.3135743 0.000239 debye
polarizability: 346.348547|-2.4941616|197.9371702|0.0722806|-6.4604455|82.9260851 unknown
InChI: InChI=1S/C16H15NO3/c1-12(18)20-15-9-7-14(8-10-15)17-11-16(19)13-5-3-2-4-6-13/h2-10,17H,11H2,1H3
charge 0 multiplicity 1
35 atoms
O  5.233396 -0.001582 -0.046704
O  -2.759405 2.16457 -0.154361
O  5.367699 -2.347265 0.116838
N  -0.316052 1.127356 -0.097598
C  -1.392432 0.16566 -0.045632
C  1.034983 0.790621 -0.080981
C  -2.742774 0.898768 -0.085856
C  -4.001377 0.095489 -0.043348
C  1.478819 -0.561765 -0.008364
C  2.023876 1.820471 -0.137772
C  3.80641 0.152854 -0.050554
C  2.852634 -0.887497 0.00704
C  3.390178 1.502751 -0.122759
C  -3.996848 -1.324656 0.034127
C  -5.244164 0.785585 -0.082218
C  -5.212578 -2.03793 0.071879
C  -6.457227 0.071582 -0.044554
C  -6.44448 -1.342448 0.032757
C  5.915018 -1.225566 0.035535
C  7.406201 -0.96126 0.005828
H  -1.356874 -0.550649 -0.898485
H  -1.357064 -0.454385 0.879643
H  -0.612872 2.106281 -0.149623
H  0.752337 -1.379387 0.038086
H  1.710675 2.869704 -0.193872
H  3.172205 -1.928452 0.064166
H  4.149704 2.28941 -0.166505
H  -3.052632 -1.878979 0.065268
H  -5.227137 1.878848 -0.141673
H  -5.203107 -3.131406 0.131487
H  -7.410565 0.609764 -0.074978
H  -7.387812 -1.898899 0.062261
H  7.684878 -0.462257 -0.938742
H  7.949282 -1.912914 0.096327
H  7.691505 -0.286116 0.830835
