program: Gaussian 09
title: 000261851
version: EM64L-G09RevD.01
frameworkgroup: C1[X(C16H34N2O2)]
method: RPBEPBE
basis: SDD
operation: Freq
keyword: #p
keyword: freq=noraman
keyword: PBEPBE/SDD
title: #p freq=noraman PBEPBE/SDD
converged: YES YES NO NO
title: Mulliken charges:
elementType: O O N N C C C C C C C C C C C C C C C C H H H H H H H H H H H H H H H H H H H H H H H H H H H H H H H H H H
charge: -0.440514 -0.440573 -0.328742 -0.328879 0.002827 -0.002448 -0.487438 -0.424250 -0.446860 -0.418718 -0.464526 -0.468555 0.307202 0.300323 -0.386504 -0.384186 -0.731532 -0.772189 -0.762845 -0.731377 0.178407 0.184157 0.175578 0.229605 0.232751 0.175060 0.186327 0.194460 0.193923 0.197487 0.208727 0.194653 0.207498 0.194650 0.234421 0.236186 0.208523 0.209776 0.211400 0.208857 0.234028 0.196053 0.227371 0.248450 0.222232 0.208237 0.206415 0.220822 0.247314 0.227054 0.196324 0.235163 0.339024 0.338848
chargesum: 0.00000
title: Mulliken charges with hydrogens summed into heavy atoms:
elementType: O O N N C C C C C C C C C C C C C C C C
charge: -0.101490 -0.101725 -0.094321 -0.092693 0.181234 0.181709 -0.082254 -0.016439 -0.066072 -0.027308 -0.061146 -0.066408 0.307202 0.300323 0.031795 0.036072 -0.074080 -0.093269 -0.088295 -0.072836
polarizability: 2.31760024e+02 -2.26820682e+00 1.88246936e+02 2.56105813e-02 -1.46849801e+00 1.67448473e+02
1716.lowfreq: -8.9431 -2.1185 -0.0009 -0.0002 0.0005 4.5265 18.4049 19.7923 27.8284
frequency: 18.3130 19.7683 27.7717 40.7098 55.1633 62.5444 102.6629 110.7678 116.6623 135.5294 152.3169 166.2872 190.5783 202.0922 212.9911 220.9640 235.6873 248.3016 253.8247 255.4248 259.6320 271.0470 294.8255 313.7352 324.9483 339.4498 342.2965 357.0742 373.2552 409.2772 413.8447 422.8141 426.8903 442.8289 446.4657 473.6099 492.0600 523.0736 561.7469 593.0556 601.3231 607.3489 740.2657 743.0957 778.6464 837.3432 849.0681 858.7074 871.4379 890.0123 897.4292 901.1644 913.1308 928.8963 939.4295 939.9491 957.6140 964.2144 966.4401 968.3728 983.0120 987.0827 1003.3191 1005.5269 1036.5588 1054.9129 1068.7221 1090.7742 1095.3802 1096.5951 1110.9894 1114.5078 1123.2956 1141.5257 1148.0163 1174.3400 1197.6327 1201.3331 1208.0665 1217.7883 1232.8313 1233.2093 1254.8536 1257.2446 1266.1735 1274.7164 1278.9715 1288.5620 1308.7154 1318.0382 1323.9108 1325.4718 1329.8006 1336.8318 1346.5285 1354.8705 1356.3924 1358.7133 1358.8637 1361.5487 1369.6853 1371.7075 1387.2291 1390.7256 1445.5087 1446.5179 1454.1847 1454.4870 1458.8614 1461.9444 1465.7761 1466.5433 1466.9430 1472.2291 1472.7258 1474.7976 1479.9203 1480.7201 1485.2698 1487.3689 1493.2633 1494.8755 2865.1927 2867.0878 2917.7850 2921.3990 2941.5977 2951.6138 2955.1139 2956.2062 2957.8955 2962.5036 2972.6761 2972.9062 2976.5041 2977.1865 3011.6091 3015.6228 3020.9225 3028.2255 3030.5106 3046.0109 3056.6755 3058.3945 3064.6125 3065.7927 3069.4950 3069.8753 3088.5218 3090.0356 3099.4960 3100.7860 3433.3319 3437.7590 3567.1635 3568.5120
redmass: 4.1378 3.3869 3.8337 3.0906 3.5985 3.7135 3.5608 2.5769 2.9384 3.5074 2.5115 2.7372 2.0571 2.4786 1.3144 1.3243 2.3906 2.2616 1.3359 1.5918 1.4133 1.8825 2.1044 1.2042 1.2242 1.8880 2.1250 2.5565 2.4701 2.4770 2.7278 2.2389 1.8817 2.6278 2.7844 2.2564 2.4699 2.5920 3.0955 1.5769 1.5242 2.0766 3.5718 3.5343 2.0774 1.9912 1.5352 1.8042 2.1476 2.0888 1.6057 1.6875 2.1240 1.6908 1.3475 1.3520 1.7952 2.3452 3.4900 2.7678 1.8444 1.6358 1.5364 1.4288 2.4790 1.1725 1.4388 2.7651 2.5882 1.8148 2.2615 1.3697 2.1805 2.1410 1.9798 1.4632 2.0406 2.2215 1.5306 1.3953 3.1671 3.1153 1.4054 1.2699 1.4658 1.5209 1.6402 1.4015 1.2442 1.3047 1.2416 1.2763 1.3949 1.4788 1.5886 1.5663 1.3761 1.2210 1.2101 1.3630 1.2732 1.2601 1.2232 1.2231 1.1749 1.1629 1.0800 1.0791 1.0897 1.0887 1.0726 1.0648 1.0751 1.0928 1.0904 1.0851 1.0684 1.0723 1.0730 1.0706 1.0872 1.0735 1.0710 1.0710 1.0811 1.0788 1.0666 1.0625 1.0674 1.0643 1.0636 1.0626 1.0369 1.0379 1.0383 1.0379 1.0961 1.0874 1.0893 1.0989 1.0957 1.0963 1.0991 1.0986 1.0982 1.0979 1.0954 1.0954 1.0994 1.0992 1.1004 1.1002 1.0740 1.0741 1.0661 1.0661
irintensity: 0.1349 0.2356 0.3689 0.3730 0.0971 0.5803 1.7757 3.4543 2.4442 1.6897 0.9340 0.6536 3.4455 4.3362 0.6665 0.9228 5.2581 8.6515 3.9125 26.4013 3.0666 0.2372 10.6174 110.6491 79.4942 53.0306 21.6767 5.1547 7.2001 4.6838 3.9927 5.0153 4.5412 2.5623 2.0020 7.1001 17.9114 3.3030 13.0711 59.5190 104.0870 13.7100 0.4625 0.3415 0.6355 4.7919 3.1089 2.5951 0.6575 4.8558 27.6232 12.1366 6.9540 8.8327 6.8736 7.5363 0.4621 42.2764 82.5540 90.4277 4.8402 4.7647 1.7152 1.7577 3.5191 2.1550 0.2615 4.2691 14.0537 0.9900 3.6894 11.6613 1.2298 28.0049 27.8616 112.1390 28.7803 34.8097 0.0348 1.7511 28.0674 8.4711 19.7944 26.5211 5.2804 2.6159 6.8769 2.2885 1.6446 12.6893 13.8387 17.8959 1.8555 0.5409 3.6677 4.9384 6.9479 4.7272 11.3232 13.0678 13.6279 26.1105 30.0784 27.5134 21.0959 20.9933 2.1182 2.7035 3.0193 3.6258 4.5837 5.1766 8.8194 3.0824 5.1752 3.0263 3.1173 3.2295 17.2409 19.0202 8.4556 12.5711 66.4579 90.6730 4.8587 16.8202 25.1134 33.1822 48.9840 69.5169 69.3095 43.4752 39.2043 48.2370 0.9471 3.1762 49.4352 22.3225 42.0274 19.0592 104.2179 49.5221 13.5243 10.7316 43.3171 45.5189 54.6417 55.6333 13.3106 14.3164 29.9420 30.6386 1.4716 1.1466 6.5726 6.7284
temp: 298.150 k
press: 1.00000 atm
elementType: 8 8 7 7 6 6 6 6 6 6 6 6 6 6 6 6 6 6 6 6 1 1 1 1 1 1 1 1 1 1 1 1 1 1 1 1 1 1 1 1 1 1 1 1 1 1 1 1 1 1 1 1 1 1
symmnumber: 1
zpe: 1270375.0 jmol-1
zpe.correction: 0.483860 hartree
zpe.thermalcorrener: 0.508653 hartree
zpe.thermalcorrenthalpy: 0.509598 hartree
zpe.thermalcorrgfe: 0.428395 hartree
zpe.sumelectzpe: -888.343185 hartree
zpe.sumelectthermal: -888.318391 hartree
zpe.sumelectthermalent: -888.317447 hartree
zpe.sumelectthermalfe: -888.398650 hartree
dipole: 0.3264 1.2738 1.4074
dipole: 1.9261
quadrupole: -159.2518 -134.0796 -117.0768
quadrupole: -2.2875 -0.4873 -5.6177
quadrupole: -22.4491 2.7231 19.7259 -2.2875 -0.4873 -5.6177
hfenergy: -888.827045 hartree
pointgroup: C01 [X(C16H34N2O2)]
dipole: 0.1280982 -0.5265785 -0.5296807 debye
polarizability: 231.8008516|1.8083658|188.0314886|0.5109444|-2.3636047|167.6230924 unknown
InChI: InChI=1S/C16H34N2O2/c1-15(2,11-19)17-9-13-6-5-7-14(8-13)10-18-16(3,4)12-20/h13-14,17-20H,5-12H2,1-4H3
charge 0 multiplicity 1
54 atoms
O  -5.76805 2.858194 -0.391727
O  6.875341 0.975663 -0.429246
N  -3.454088 -0.094115 0.442291
N  3.247571 0.235799 0.598575
C  -1.076345 -0.838476 0.303094
C  1.418512 -1.439116 0.33058
C  0.34778 -0.425748 -0.140879
C  -1.406575 -2.261041 -0.210691
C  1.078438 -2.864069 -0.176124
C  -0.347618 -3.290804 0.246509
C  -2.129798 0.201727 -0.149786
C  2.844139 -1.008616 -0.094358
C  -4.684637 0.574941 -0.071621
C  4.383846 1.060315 0.094175
C  -4.604033 2.122841 0.136454
C  5.713276 0.237154 0.097978
C  -5.88161 0.013963 0.728946
C  -4.871112 0.251685 -1.575715
C  4.076071 1.56525 -1.338042
C  4.528958 2.269356 1.046176
H  -1.085424 -0.868358 1.417891
H  1.39144 -1.46608 1.444808
H  0.376429 -0.369029 -1.252005
H  0.60937 0.579724 0.240761
H  -2.41786 -2.550479 0.128988
H  -1.435146 -2.236071 -1.3218
H  1.151207 -2.88038 -1.284912
H  1.824821 -3.590722 0.204276
H  -0.385212 -3.387434 1.351905
H  -0.583433 -4.290414 -0.16802
H  -2.222197 0.154035 -1.252046
H  -1.74375 1.221404 0.096971
H  2.846085 -0.818419 -1.184804
H  3.539059 -1.866123 0.082753
H  -3.422184 -0.074642 1.471198
H  3.30663 0.102096 1.617336
H  -4.604529 2.355177 1.216487
H  -3.664866 2.512439 -0.311271
H  5.569125 -0.709689 -0.464999
H  5.99621 -0.008172 1.137182
H  -6.79796 0.581296 0.490506
H  -5.703036 0.103957 1.818652
H  -6.037771 -1.053559 0.494769
H  -4.729378 -0.831148 -1.735576
H  -5.891782 0.515045 -1.907514
H  -4.148151 0.791831 -2.216826
H  4.134785 0.757807 -2.092982
H  4.783777 2.362467 -1.629104
H  3.056017 1.985583 -1.364672
H  3.645878 2.928051 0.972936
H  4.621002 1.93316 2.097982
H  5.437928 2.843934 0.797424
H  -5.751607 2.80862 -1.380552
H  6.754654 1.103389 -1.403731
