program: Gaussian 09
title: 000261829
version: EM64L-G09RevD.01
frameworkgroup: C1[X(C13H13NO)]
method: RPBEPBE
basis: SDD
operation: Freq
keyword: #p
keyword: freq=noraman
keyword: PBEPBE/SDD
title: #p freq=noraman PBEPBE/SDD
converged: NO YES NO NO
title: Mulliken charges:
elementType: O N C C C C C C C C C C C C C H H H H H H H H H H H H H
charge: -0.259058 -0.075057 0.476279 -0.431708 0.118490 -0.388577 -0.388872 0.183431 -0.326126 -0.226985 -0.227040 -0.336440 -0.144830 -0.233206 -0.773341 0.224626 0.224924 0.234051 0.233983 0.254936 0.226396 0.226419 0.235580 0.235760 0.228750 0.248764 0.229416 0.229434
chargesum: 0.00000
title: Mulliken charges with hydrogens summed into heavy atoms:
elementType: O N C C C C C C C C C C C C C
charge: -0.259058 -0.075057 0.476279 0.017842 0.118490 -0.154526 -0.154889 0.183431 -0.071190 -0.000589 -0.000621 -0.100860 0.090930 -0.004456 -0.065727
polarizability: 2.23938277e+02 9.24964325e+00 1.17346166e+02 -1.89087282e-02 -1.29960018e-01 1.09738415e+02
1716.lowfreq: -42.2127 -12.0550 -5.5285 -0.0010 -0.0009 -0.0007 5.4361 10.2338 18.0060
frequency: -41.9987 5.3902 17.4257 59.6124 97.3626 136.6662 192.7929 225.8076 241.3889 322.2600 326.9675 402.8879 422.9826 445.7170 514.2354 533.3923 542.9197 595.9824 617.0919 627.1920 699.5540 712.7916 733.0928 764.3602 793.9649 833.1576 852.9116 886.0305 887.3010 930.8577 938.5599 950.8564 958.5110 975.8911 981.3338 990.9868 995.8216 1012.7948 1026.3684 1045.5206 1077.4876 1087.8887 1164.6212 1172.3835 1186.6612 1186.8293 1226.0211 1228.0188 1273.8501 1324.1364 1331.1472 1347.6513 1385.4417 1385.6736 1393.9208 1439.4434 1444.1328 1465.6518 1469.7406 1470.1542 1486.6654 1569.9046 1583.5646 1595.9640 1617.4181 2983.2088 3009.5480 3061.5256 3071.7049 3114.1137 3120.3867 3123.0259 3134.9874 3139.1511 3147.2669 3160.4923 3163.4958 3182.4853
redmass: 1.0456 3.6360 4.1666 4.6997 4.2001 4.9675 3.2310 5.5346 4.8385 3.2252 2.2393 2.7956 3.7810 3.6224 3.6726 6.4844 5.1881 3.4686 6.3411 6.2155 2.3648 2.6357 2.3982 2.2706 1.6613 3.6768 1.2474 4.0946 1.3497 1.6971 3.1191 1.6139 4.1340 1.3929 1.3179 5.8319 1.3383 2.3159 2.1756 1.5726 1.5240 1.5142 1.1281 1.0542 1.0859 1.1163 2.1042 2.2356 3.4878 1.2768 7.4128 1.5424 8.7865 1.7450 1.7716 2.1927 2.6910 1.1180 1.0464 1.1113 2.4135 6.7045 5.7369 6.1516 6.2076 1.0379 1.0576 1.0974 1.1072 1.0984 1.0850 1.0881 1.0921 1.0878 1.0964 1.0952 1.1017 1.0978
irintensity: 0.1935 0.2539 0.0915 0.8232 4.8578 1.5150 5.4189 0.8005 0.5240 3.6521 0.9686 0.0072 2.7057 0.0678 9.8582 4.9143 7.5692 0.3017 0.1509 13.6017 29.4249 39.6920 12.7616 49.3826 67.3876 17.9076 0.0014 39.9416 0.1660 1.6490 33.4378 1.8169 53.9233 0.0213 0.8726 0.3835 0.0258 84.2680 1.1677 7.6625 10.7635 7.6017 4.7117 0.0009 0.9167 2.8692 186.2692 0.2431 165.1294 0.2690 73.8670 31.7111 0.2914 25.4609 13.4350 8.6992 153.4056 32.7397 14.0118 8.4993 8.5137 127.0356 129.7792 0.6328 0.3686 21.9519 22.9533 19.1974 15.2167 11.1299 4.8896 1.7327 16.7151 8.0605 43.4908 19.3291 22.8127 5.9988
temp: 298.150 k
press: 1.00000 atm
elementType: 8 7 6 6 6 6 6 6 6 6 6 6 6 6 6 1 1 1 1 1 1 1 1 1 1 1 1 1
symmnumber: 1
zpe: 589905.5 jmol-1
zpe.correction: 0.224683 hartree
zpe.thermalcorrener: 0.237320 hartree
zpe.thermalcorrenthalpy: 0.238264 hartree
zpe.thermalcorrgfe: 0.181655 hartree
zpe.sumelectzpe: -632.085938 hartree
zpe.sumelectthermal: -632.073301 hartree
zpe.sumelectthermalent: -632.072356 hartree
zpe.sumelectthermalfe: -632.128965 hartree
dipole: -0.8337 -0.1361 0.0017
dipole: 0.8447
quadrupole: -69.6742 -87.1829 -84.3115
quadrupole: -0.4505 -0.0180 -0.0441
quadrupole: 10.7153 -6.7933 -3.9220 -0.4505 -0.0180 -0.0441
hfenergy: -632.3106208 hartree
pointgroup: C01 [X(C13H13N1O1)]
dipole: 0.326686 0.0610338 -0.0005519 debye
polarizability: 223.4600179|11.6726229|117.8263244|-0.2392925|-0.0188729|109.7365161 unknown
InChI: InChI=1S/C13H13NO/c1-11-6-5-9-13(14-11)15-10-12-7-3-2-4-8-12/h2-9H,10H2,1H3
charge 0 multiplicity 1
28 atoms
O  0.130987 -0.582988 0.011178
N  2.105504 0.731419 -0.014875
C  -2.092629 0.376199 -0.007866
C  -0.621888 0.712956 -0.020333
C  1.517952 -0.491645 0.011202
C  -2.798777 0.185599 -1.222244
C  -2.791958 0.2512 1.218909
C  3.475361 0.800647 -0.014059
C  2.237711 -1.714603 0.039503
C  -4.17632 -0.127471 -1.212535
C  -4.169433 -0.061803 1.233921
C  4.275454 -0.36674 0.012915
C  3.641607 -1.634432 0.039919
C  -4.865088 -0.251512 0.016853
C  4.088154 2.186539 -0.043296
H  -0.32202 1.264998 -0.929096
H  -0.317979 1.311064 0.857354
H  -2.2651 0.2797 -2.17586
H  -2.252954 0.396476 2.163079
H  1.69847 -2.664688 0.059844
H  -4.71142 -0.271891 -2.157844
H  -4.699139 -0.155182 2.188635
H  5.366526 -0.28159 0.012814
H  4.240195 -2.551476 0.061179
H  -5.93438 -0.491806 0.026266
H  3.290317 2.945133 -0.061195
H  4.724247 2.361696 0.844409
H  4.727297 2.323009 -0.935579
