program: Gaussian 09
title: 000261834
version: EM64L-G09RevD.01
frameworkgroup: C1[X(C16H14N2O5)]
method: RPBEPBE
basis: SDD
operation: Freq
keyword: #p
keyword: freq=noraman
keyword: PBEPBE/SDD
title: #p freq=noraman PBEPBE/SDD
converged: NO NO NO NO
title: Mulliken charges:
elementType: O O O O O N N C C C C C C C C C C C C C C C C H H H H H H H H H H H H H H
charge: -0.170049 -0.177788 -0.183600 -0.182031 -0.181047 0.023959 0.019606 0.070199 0.343010 0.343035 0.484226 -0.031074 -0.613070 -0.613259 0.383988 -0.838819 -0.838813 -0.482709 -0.511119 -0.812318 0.423523 0.418933 -0.512973 0.243424 0.243429 0.229674 0.239192 0.256693 0.256685 0.239197 0.229690 0.325558 0.337336 0.227739 0.239924 0.227746 0.341904
chargesum: 0.00000
title: Mulliken charges with hydrogens summed into heavy atoms:
elementType: O O O O O N N C C C C C C C C C C C C C C C C
charge: -0.170049 -0.177788 -0.183600 -0.182031 -0.181047 0.023959 0.019606 0.070199 0.343010 0.343035 0.484226 -0.031074 -0.369647 -0.369830 0.383988 -0.113261 -0.113242 -0.157151 -0.173783 -0.116910 0.423523 0.418933 -0.171069
polarizability: 2.85323039e+02 1.91889904e+01 2.04216422e+02 -8.25708571e-03 3.13162453e-03 1.47722296e+02
1716.lowfreq: -28.7988 -0.0005 -0.0002 0.0005 4.0572 7.5889 7.9637 20.8437 37.8584
frequency: -28.7421 19.8903 37.8529 50.8400 52.3096 55.4514 83.4836 88.1443 90.3379 101.6616 132.9067 136.4382 161.9489 185.1112 193.8488 198.7539 227.2178 249.6292 266.7128 299.1027 313.4395 328.0256 351.1294 396.6759 443.7260 462.9071 479.9229 489.7397 506.4775 514.0702 521.8804 545.1797 564.0172 584.8648 615.6522 643.7720 682.1622 697.1343 711.1557 724.4910 751.6697 761.8104 792.3855 860.7607 867.2237 900.5866 932.8135 940.3790 964.7664 973.0309 974.7087 987.2399 996.0811 1016.1262 1017.6039 1042.4370 1043.7421 1044.8781 1051.3398 1069.4103 1089.4332 1140.5439 1185.5908 1203.5419 1213.9287 1231.1049 1255.4030 1256.2156 1316.5622 1356.2799 1380.9185 1384.9607 1397.6763 1398.7376 1399.5682 1400.7336 1413.9381 1434.4700 1441.5357 1452.7848 1470.8532 1471.5550 1472.3109 1473.9134 1480.5722 1492.4415 1567.2102 1578.0694 1596.0535 1615.3292 1618.5236 2974.9730 2975.5825 2977.3237 3052.4896 3052.6257 3059.5424 3087.7524 3091.2492 3091.5898 3117.5815 3121.5652 3168.7275 3173.2568 3192.5502
redmass: 4.7888 6.3541 5.0283 14.7239 15.7105 1.0123 1.4830 5.2772 1.1419 2.0311 9.3802 6.3722 5.8141 3.2224 4.8229 4.7278 2.8370 4.0440 2.5192 8.8871 4.0376 10.4032 10.4166 6.9255 3.6260 5.6703 6.1634 3.5736 8.4808 3.1287 5.4549 4.8913 4.3282 4.7622 3.4563 5.3411 12.1586 2.9937 10.6664 9.1689 4.1623 5.8273 8.6522 10.9767 1.3161 1.3108 2.3447 3.6603 5.5951 1.4417 1.5651 6.1099 1.4206 1.6902 1.5763 1.7889 1.5509 1.5323 1.6171 1.3738 1.4944 4.7072 2.2672 14.4709 5.2100 1.2479 1.4238 4.6239 6.5733 7.2866 9.6910 9.8192 1.2232 1.3431 5.6021 1.2359 2.2917 5.6495 2.1136 3.7696 1.0518 1.0465 1.0915 1.0550 1.1646 1.4447 9.8490 7.0490 8.8218 8.5157 5.9628 1.0387 1.0387 1.0385 1.0960 1.0960 1.0952 1.1000 1.0987 1.0986 1.0910 1.0920 1.0920 1.0926 1.0929
irintensity: 0.3212 0.1010 0.0941 0.0491 0.0008 0.4428 2.1298 8.4092 1.0229 0.4058 1.7687 0.4831 1.4910 4.6110 0.4792 0.8206 0.0051 5.2676 0.2897 1.5936 0.2789 0.2068 2.3645 0.4980 0.0651 0.0112 4.6775 1.0942 4.4069 0.0183 0.0089 5.0008 0.3188 4.4582 17.2891 0.0859 41.2373 34.5820 36.2161 0.0366 2.6585 4.1486 4.9618 22.1214 20.1266 0.0001 0.2360 26.9934 42.4654 1.5260 31.0664 0.7661 8.0066 8.2535 2.1120 0.0732 2.1245 0.0015 32.1621 64.4225 109.5565 6.2829 80.8199 284.6921 154.8488 0.2045 0.0509 82.7932 10.4075 0.1322 42.4597 129.5917 16.5907 21.8990 16.3186 2.7000 1.3428 13.9696 54.6080 10.0634 31.0545 0.4695 7.2452 14.1580 32.9327 9.0120 59.5254 14.4120 57.4981 8.7666 59.1585 28.8683 27.1543 23.8203 1.3120 33.1864 18.6503 14.1748 16.2651 20.5392 21.0728 11.5458 8.7239 14.8682 25.6906
temp: 298.150 k
press: 1.00000 atm
elementType: 8 8 8 8 8 7 7 6 6 6 6 6 6 6 6 6 6 6 6 6 6 6 6 1 1 1 1 1 1 1 1 1 1 1 1 1 1
symmnumber: 1
zpe: 708934.7 jmol-1
zpe.correction: 0.270019 hartree
zpe.thermalcorrener: 0.291289 hartree
zpe.thermalcorrenthalpy: 0.292233 hartree
zpe.thermalcorrgfe: 0.217776 hartree
zpe.sumelectzpe: -1101.926941 hartree
zpe.sumelectthermal: -1101.905671 hartree
zpe.sumelectthermalent: -1101.904727 hartree
zpe.sumelectthermalfe: -1101.979184 hartree
dipole: 5.0268 0.3998 -0.0056
dipole: 5.0427
quadrupole: -142.8654 -162.1916 -121.7758
quadrupole: 1.5113 0.0153 0.0036
quadrupole: -0.5878 -19.9140 20.5018 1.5113 0.0153 0.0036
hfenergy: -1102.19696 hartree
pointgroup: C01 [X(C16H14N2O5)]
dipole: -1.9751325 -0.1869074 -0.0018553 debye
polarizability: 284.7295648|20.3960657|204.8098752|-0.0200729|-0.0348105|147.7223165 unknown
InChI: InChI=1S/C16H14N2O5/c1-9-4-10(2)15(11(3)5-9)16(19)12-6-13(17(20)21)8-14(7-12)18(22)23/h4-8H,1-3H3
charge 0 multiplicity 1
37 atoms
O  -0.507177 2.79756 -0.000584
O  4.419067 2.513633 -0.000694
O  0.531203 -3.50109 0.002305
O  5.455137 0.478384 -0.000333
O  2.812006 -3.61445 0.001516
N  4.406736 1.226732 -0.001876
N  1.701563 -2.962686 0.000285
C  -1.949416 0.837736 0.000122
C  -2.579167 0.529447 -1.239692
C  -2.578686 0.529745 1.240247
C  -4.489673 -0.438276 0.000761
C  -0.610829 1.53858 -0.000234
C  -3.840594 -0.110527 -1.214694
C  -3.840128 -0.110244 1.215882
C  0.643336 0.685456 -0.000426
C  -1.922565 0.886964 -2.563786
C  -1.921586 0.887585 2.564006
C  0.575463 -0.728231 0.000001
C  1.906515 1.330686 -0.00103
C  -5.856711 -1.098602 0.001088
C  3.07194 0.546506 -0.001206
C  1.774547 -1.467996 -0.000181
C  3.043218 -0.861939 -0.000772
H  -4.326922 -0.356368 -2.1671
H  -4.32609 -0.355859 2.168531
H  -0.936971 0.396343 -2.683788
H  -2.552884 0.576194 -3.413365
H  -1.754006 1.976538 -2.645661
H  -1.753002 1.97718 2.64555
H  -2.551581 0.577018 3.413898
H  -0.935944 0.397001 2.683753
H  -0.386555 -1.249786 0.000464
H  1.959498 2.423846 -0.001354
H  -6.00174 -1.729109 0.895669
H  -6.662178 -0.338704 0.000147
H  -6.001325 -1.730848 -0.892339
H  3.962001 -1.453823 -0.000911
