program: Gaussian 09
title: 000261820
version: EM64L-G09RevD.01
frameworkgroup: C1[X(C9H10N2O3)]
method: RPBEPBE
basis: SDD
operation: Freq
keyword: #p
keyword: freq=noraman
keyword: PBEPBE/SDD
title: #p freq=noraman PBEPBE/SDD
converged: YES YES NO NO
title: Mulliken charges:
elementType: O O O N N C C C C C C C C C H H H H H H H H H H
charge: -0.317841 -0.284260 -0.315234 -0.359343 -0.297646 0.275979 -0.346392 -0.339364 0.210007 -0.218654 -0.235720 -0.225619 0.312554 -0.493375 0.277461 0.211475 0.234192 0.232671 0.234499 0.351476 0.370241 0.243367 0.236312 0.243213
chargesum: 0.00000
title: Mulliken charges with hydrogens summed into heavy atoms:
elementType: O O O N N C C C C C C C C C
charge: -0.317841 -0.284260 -0.315234 -0.007866 0.072595 0.275979 -0.068930 -0.127889 0.210007 0.015538 -0.003050 0.008880 0.312554 0.229517
polarizability: 2.12852898e+02 -2.08525937e+00 1.24215779e+02 -2.48974218e+00 1.86859410e+00 5.44585951e+01
1716.lowfreq: -10.3456 -6.9923 0.0006 0.0007 0.0009 1.9430 16.5496 44.4289 54.1904
frequency: 16.4302 44.4222 54.1647 62.4713 86.0937 129.0024 160.9038 177.1313 240.8050 262.8267 273.1576 324.9475 397.0744 419.8634 452.1090 520.3495 542.9314 599.0736 613.8417 636.5805 668.9865 675.3280 690.9971 697.5148 788.1348 825.3387 850.6505 931.2200 934.1663 984.6636 989.4747 1007.9016 1014.3939 1024.6334 1073.2220 1092.9332 1119.2553 1152.9937 1174.2228 1191.1091 1201.3416 1213.5740 1281.6578 1325.2357 1385.9763 1393.8468 1433.2668 1441.4882 1452.6221 1468.5689 1484.2922 1542.3609 1546.4833 1596.9403 1611.8486 1644.2215 3005.1733 3107.1303 3122.3408 3134.3745 3147.6639 3150.4535 3160.6802 3171.6329 3518.8976 3542.2615
redmass: 4.1894 3.6703 1.2555 5.1738 6.1891 3.5385 5.1730 5.1622 7.2260 5.3012 6.0895 6.9292 2.7203 5.6595 3.8869 1.3094 4.1923 1.1584 6.4117 6.8385 7.1804 6.1969 3.5911 1.6508 2.2033 7.4388 1.2574 5.1649 1.5624 1.3939 5.9247 1.3414 4.3702 2.4928 2.3278 1.9811 1.2492 1.4470 1.0612 1.4095 2.1022 2.0516 2.1027 1.3763 7.5302 2.0975 1.9231 1.5699 1.0500 1.0671 2.2784 4.9231 2.8633 6.3607 5.9866 9.8232 1.0297 1.1051 1.0871 1.0872 1.0922 1.1045 1.0958 1.1008 1.0797 1.0793
irintensity: 0.4689 0.5084 0.0603 3.2469 7.0199 14.0568 1.2827 2.0324 0.5434 30.5859 25.1763 3.1602 1.2572 2.1584 0.9290 72.4008 27.2919 138.4475 0.4570 2.6086 58.2092 13.0994 9.4101 94.5510 27.6050 11.4747 0.4476 29.3064 5.9522 0.6482 0.5712 1.1609 72.4769 0.6977 22.2562 38.9833 0.2533 62.8459 0.6562 20.1007 130.9230 23.0099 12.6716 0.4652 35.4489 631.1817 30.3769 339.0926 14.0374 4.9961 52.7233 230.3407 90.9931 48.9329 6.9993 212.2578 48.5535 28.2834 10.1074 1.6721 21.6787 16.1072 13.8707 19.9061 55.6828 128.2947
temp: 298.150 k
press: 1.00000 atm
elementType: 8 8 8 7 7 6 6 6 6 6 6 6 6 6 1 1 1 1 1 1 1 1 1 1
symmnumber: 1
zpe: 478420.4 jmol-1
zpe.correction: 0.182221 hartree
zpe.thermalcorrener: 0.195865 hartree
zpe.thermalcorrenthalpy: 0.196810 hartree
zpe.thermalcorrgfe: 0.139254 hartree
zpe.sumelectzpe: -683.099842 hartree
zpe.sumelectthermal: -683.086197 hartree
zpe.sumelectthermalent: -683.085253 hartree
zpe.sumelectthermalfe: -683.142808 hartree
dipole: -0.1332 -1.8316 0.1764
dipole: 1.8449
quadrupole: -54.2290 -85.9905 -84.6253
quadrupole: 4.5889 -0.9341 1.8201
quadrupole: 20.7193 -11.0422 -9.6771 4.5889 -0.9341 1.8201
hfenergy: -683.2820622 hartree
pointgroup: C01 [X(C9H10N2O3)]
dipole: 0.0479637 0.7220407 0.0565086 debye
dipolederiv: -0.6864078 -0.2217964 -0.0074123 0.2767755 -1.0121138 -0.0434554 0.0187117 -0.0308021 -0.3784352 -2.0154462 0.0156986 -0.0180626 -0.4733368 -0.4810459 -0.0175529 -0.0432614 -0.011633 -0.3197221 -0.7550002 -0.0382994 -0.0092121 0.3732878 -1.0448527 -0.0478413 0.0220632 -0.0480835 -0.3689421 -0.5317269 0.287752 0.0232984 0.7025104 -0.5179204 0.0063255 0.0498256 0.0113053 -0.2802116 -1.429001 0.3302893 0.0116427 0.7521688 -0.5048066 -0.0163294 0.0312259 -0.0165536 -0.3089565 -0.2047183 -0.1032901 -0.0117955 -0.159809 -0.1041879 -0.013971 -0.0397979 -0.0107911 0.0007962 -0.0559168 0.0905938 -0.0009692 -0.0587971 0.039765 -0.0239656 0.0013424 -0.0037604 -0.1144131 -0.0189485 -0.0499446 0.0350927 0.0325689 -0.0033817 -0.0207851 0.0505351 -0.0214792 -0.1414974 1.5634251 -0.0302693 -0.0049497 -0.5396392 1.2561135 0.0751908 -0.0235621 0.0446585 0.2203013 0.0699652 -0.1508484 0.0361131 -0.1712469 -0.0283052 -0.0255502 0.040074 -0.026999 -0.144993 -0.1684602 0.0149259 -0.003237 0.0792694 0.1338682 -0.0309985 -0.0132485 -0.0327227 -0.1400786 0.0642689 0.0635327 0.016116 0.0160675 -0.0095791 -0.0133287 0.0173708 -0.0109026 -0.1434379 2.7322839 -0.213085 0.0092008 -0.5090315 1.4862815 0.0825195 -0.0247371 0.0779532 0.3364354 0.8952126 -0.1013659 0.0000414 -0.2873427 0.2609547 -0.0047316 -0.012598 -0.0022185 0.2861969 0.1537244 -0.0368425 0.0015847 -0.0039286 -0.0006907 0.0214559 0.0124337 0.0134699 0.1561241 -0.0495301 0.1052242 -0.033717 0.1040541 0.0338818 0.0244754 -0.0377276 0.0198615 0.1422728 -0.0580513 0.0875279 -0.0273338 0.1031503 0.0153855 0.0254602 -0.03063 0.0246168 0.1528306 0.0685201 -0.025099 -0.0050988 -0.0566973 -0.104638 0.0301781 -0.0033369 0.0319743 0.1552271 -0.098327 -0.072458 -0.0132553 -0.0777049 0.0659796 0.0054241 -0.0114001 0.0041668 0.1586998 0.3175723 0.0210335 0.0034586 -0.14112 0.1875492 -0.011362 -0.0089519 -0.0128316 0.349255 0.2734409 0.0828464 0.0027855 -0.080822 0.27578 -0.0058529 -0.0012885 -0.0019982 0.3755879 0.001536 0.0089435 -0.0217275 0.1229956 0.0385574 -0.0909856 0.0417565 -0.0878987 -0.0714788 -0.0706513 -0.069096 -0.0065496 -0.128785 0.0037792 -0.0092482 -0.0101891 -0.0085069 0.1250463 0.0022362 0.0040267 0.0239865 0.1254126 0.0136264 0.1049288 -0.0246096 0.0991747 -0.0466071 unknown
polarizability: 212.7760148|-1.5404985|124.1023965|4.645487|-3.1850812|54.648861 unknown
InChI: InChI=1S/C9H10N2O3/c1-14-9(13)11-10-8(12)7-5-3-2-4-6-7/h2-6,10-11H,1H3
charge 0 multiplicity 1
24 atoms
O  0.159515 -2.099774 -0.086395
O  -4.279197 -0.486514 -0.053235
O  -3.029025 1.523882 0.09245
N  -0.73989 0.010464 0.008519
N  -2.014459 -0.565245 -0.040311
C  1.707598 -0.20283 0.017784
C  2.815261 -1.067945 0.209848
C  1.932365 1.191758 -0.134768
C  0.352501 -0.836709 -0.026462
C  4.124864 -0.548349 0.262896
C  3.243838 1.709352 -0.081585
C  4.343298 0.842145 0.120672
C  -3.106127 0.264587 0.006437
C  -5.525048 0.311406 -0.012202
H  2.619228 -2.140322 0.310307
H  1.104297 1.88659 -0.32019
H  4.973423 -1.22426 0.41375
H  3.409148 2.785125 -0.204155
H  5.36046 1.247022 0.160897
H  -0.746153 1.027963 0.111314
H  -2.019079 -1.588088 -0.099961
H  -5.581706 0.887347 0.926608
H  -6.331091 -0.433244 -0.068141
H  -5.565422 1.00444 -0.869178
