program: Gaussian 09
title: 000261814
version: EM64L-G09RevD.01
frameworkgroup: C1[X(C10H8ClNO2S)]
method: RPBEPBE
basis: SDD
operation: Freq
keyword: #p
keyword: freq=noraman
keyword: PBEPBE/SDD
title: #p freq=noraman PBEPBE/SDD
converged: YES YES NO NO
title: Mulliken charges:
elementType: Cl S O O N C C C C C C C C C C H H H H H H H H
charge: -0.033089 0.051551 -0.395177 -0.233584 -0.011962 0.465364 -0.806355 0.100501 0.377115 -0.337314 -0.443712 -0.112167 -0.802497 0.277332 -0.291344 0.356355 0.314468 0.271318 0.250578 0.239529 0.251960 0.122998 0.388132
chargesum: 0.00000
title: Mulliken charges with hydrogens summed into heavy atoms:
elementType: Cl S O O N C C C C C C C C C C
charge: -0.033089 0.174549 -0.007045 -0.233584 -0.011962 0.465364 -0.450000 0.100501 0.377115 -0.022846 -0.172393 -0.112167 -0.060430 0.277332 -0.291344
polarizability: 1.70214379e+02 1.89637906e+01 1.81152229e+02 1.78342431e+00 -5.56049434e+00 9.38273913e+01
1716.lowfreq: -8.6114 -5.9354 -2.9343 -0.0009 0.0006 0.0010 24.5898 38.4813 68.6222
frequency: 24.5160 38.4580 68.6202 86.9465 88.8746 106.6756 125.5896 163.6868 184.8879 228.5185 235.5166 236.7273 266.0132 270.7344 325.2193 336.6054 406.2730 481.1115 495.7526 531.9742 544.2049 580.5548 588.8881 595.3529 619.7982 657.4311 689.2657 747.3415 764.7988 842.4431 869.4243 884.9581 914.6467 924.1957 975.7094 1025.3102 1046.3469 1060.7045 1097.3274 1179.1260 1216.6284 1235.7771 1263.1343 1268.3919 1348.5639 1373.5563 1402.0267 1415.5232 1441.5505 1464.6897 1476.2797 1571.4284 1587.0074 1650.9261 2168.6389 2423.9091 2987.4058 3065.6716 3092.8782 3102.1767 3165.7937 3169.8457 3509.1286
redmass: 9.1629 7.5880 7.2711 11.5762 1.0362 11.1042 11.3861 5.5742 4.2250 4.1554 3.0909 1.8643 4.1706 3.7653 8.1131 17.7874 4.8229 7.0880 5.7075 3.9052 4.4320 3.8917 3.5935 4.1738 4.5584 1.8552 2.8386 6.9781 4.2969 3.5726 4.6767 1.3602 2.0287 1.5160 2.8271 2.1072 1.5537 2.1656 2.0809 3.1110 1.2420 1.4306 1.4384 3.4340 3.4034 3.2347 1.4429 2.3247 2.8560 1.0437 1.1892 8.7506 6.0745 8.3159 12.6290 1.0381 1.0378 1.0971 1.0856 1.0994 1.0929 1.0933 1.0640
irintensity: 0.0645 3.6833 2.3022 0.9799 0.8402 1.8904 1.6978 0.8330 0.6704 0.9139 9.1679 22.8406 5.5705 0.5528 5.2700 1.9829 1.8145 0.1112 4.6783 29.5611 1.1940 23.4847 44.9040 28.7251 15.3220 127.4391 12.8639 8.6487 7.0943 16.8935 35.0371 17.7040 5.5421 9.5392 21.9075 45.8221 7.2544 264.5787 4.1191 11.5814 4.8617 1.0985 9.7362 37.5982 59.8430 19.1363 23.2281 4.5983 12.2148 16.9873 50.0908 35.9584 103.7205 159.4026 29.7960 9.4627 10.0646 8.6180 1.5941 15.6445 0.3296 12.7157 42.4744
temp: 298.150 k
press: 1.00000 atm
elementType: 17 16 8 8 7 6 6 6 6 6 6 6 6 6 6 1 1 1 1 1 1 1 1
symmnumber: 1
zpe: 405004.5 jmol-1
zpe.correction: 0.154258 hartree
zpe.thermalcorrener: 0.169806 hartree
zpe.thermalcorrenthalpy: 0.170750 hartree
zpe.thermalcorrgfe: 0.109477 hartree
zpe.sumelectzpe: -1448.102772 hartree
zpe.sumelectthermal: -1448.087224 hartree
zpe.sumelectthermalent: -1448.086280 hartree
zpe.sumelectthermalfe: -1448.147553 hartree
dipole: -1.7704 -1.1037 -0.8099
dipole: 2.2380
quadrupole: -93.0110 -116.0246 -98.5304
quadrupole: -15.3924 -4.4035 0.7467
quadrupole: 9.5110 -13.5026 3.9916 -15.3924 -4.4035 0.7467
hfenergy: -1448.2570304 hartree
pointgroup: C01 [X(C10H8Cl1N1O2S1)]
dipole: -0.3970608 0.7660822 0.1752818 debye
dipolederiv: -0.1275986 0.0468997 -0.0096581 0.0827737 -0.8707045 0.1809995 -0.0191992 0.1960232 -0.0988917 -0.4015049 0.0343134 -0.0425345 0.0475 0.1214364 -0.015629 0.0812391 -0.1294533 -0.184435 -0.5815092 0.2603056 -0.3696881 0.2560872 -0.4148978 0.2557715 -0.4116804 0.2828135 -0.9370682 -0.6166232 -0.2455894 -0.1082084 -0.0505829 -0.7852037 0.1290918 -0.2250234 0.0932088 -0.509183 -0.2427265 -0.0070369 0.0029318 -0.003313 -0.4163886 0.0591205 -0.0052013 0.0551209 -0.2422689 0.207376 0.1026441 -0.0805166 -0.225544 0.2558057 -0.0650853 -0.1134717 -0.0503033 -0.0670397 0.1490714 -0.1564212 -0.1912924 -0.1709541 -0.0787103 -0.0882458 -0.1814728 0.0788366 0.154957 -0.116626 -0.0297948 0.0269786 0.0661524 -0.2003077 0.0596374 -0.0096366 0.063744 0.0392027 0.3241403 -0.004003 -0.0053337 0.2801456 0.2211029 -0.0713835 -0.0674922 -0.050965 0.03071 -0.2739195 0.1933177 -0.0167758 0.2213385 -0.5170171 0.0750971 -0.0396089 0.1018652 -0.1181812 -0.1708006 -0.1058502 0.0493697 -0.2422869 -0.4457036 0.0786742 0.0593966 0.0754101 -0.1458364 0.3303983 -0.1230668 0.0153422 -0.1348874 1.3505796 -0.3104088 0.0377567 -0.3280922 0.0455654 -0.0737165 -0.0983159 0.0259782 -0.1825444 -0.0584206 0.0246386 0.0444104 0.0244728 0.0303693 0.8636511 0.2130968 0.6881346 0.1122626 0.9894148 -0.2906251 0.8098513 -0.3458278 1.0649113 -0.0046122 -0.0178017 -0.009007 -0.0087973 0.4218274 -0.1145398 0.0081695 -0.1045094 0.0419459 0.0903013 -0.0036815 0.0245858 0.021057 0.0413588 0.0077405 0.0214633 0.0104665 0.0551642 0.1538905 -0.0499442 0.0330555 -0.0425204 0.1098338 0.0081479 0.0256148 0.006612 0.1464602 -0.010299 0.0545519 -0.0132293 0.0396637 0.0776566 0.020231 -0.0120324 0.019938 0.1542132 0.0527148 -0.0188572 -0.0260449 -0.0301099 0.0790548 0.0718022 0.0251439 0.0670737 -0.0527581 -0.053869 0.0526766 -0.0115233 0.155164 0.0119465 0.0228019 -0.0370898 0.024284 0.1090108 0.0525582 -0.0052061 0.0317989 -0.0388137 -0.0039064 -0.0927736 -0.0084012 -0.0905851 0.0322004 0.1694129 0.0311799 0.0313921 0.005386 -0.104072 0.0646517 0.0231286 -0.0114613 0.0683009 0.2802905 -0.1234169 -0.0457553 -0.1571769 0.2153149 -0.0097148 -0.0058642 0.0113281 0.3826508 unknown
polarizability: 156.746645|-5.1315911|190.2454206|-1.6855958|-21.3926963|98.2019339 unknown
InChI: InChI=1S/C10H8ClNO2S/c1-5-2-6(11)3-7(8(5)4-12)9(15)10(13)14/h2-3,9,13,15H,1H3
charge 0 multiplicity 1
23 atoms
Cl -1.164278 3.716499 -0.913782
S  2.20966 -1.381712 -1.597972
O  3.287661 -0.611561 1.782591
O  3.107458 1.205623 0.349158
N  -0.907902 -3.318758 0.78923
C  0.250625 -0.024644 -0.018332
C  1.58187 -0.742415 0.106849
C  -0.964782 -0.757991 0.167597
C  -2.242341 -0.130691 0.019834
C  0.180986 1.349524 -0.348258
C  -2.284127 1.24118 -0.313935
C  -1.080892 1.950841 -0.489355
C  -3.521523 -0.917884 0.218344
C  2.707423 0.07869 0.720664
C  -0.920654 -2.156007 0.505713
H  1.476185 -1.67396 0.682809
H  1.098323 1.928882 -0.481799
H  -3.246131 1.747525 -0.433989
H  -3.573327 -1.347368 1.235819
H  -4.408949 -0.282379 0.067705
H  -3.581382 -1.767473 -0.486616
H  2.353533 -0.115816 -2.147019
H  4.049361 -0.084403 2.149844
