program: Gaussian 09
title: 000261847
version: EM64L-G09RevD.01
frameworkgroup: C1[X(C29H18N2O4)]
method: RPBEPBE
basis: SDD
operation: Freq
keyword: #p
keyword: freq=noraman
keyword: PBEPBE/SDD
title: #p freq=noraman PBEPBE/SDD
converged: YES YES NO NO
title: Mulliken charges:
elementType: O O O O N N C C C C C C C C C C C C C C C C C C C C C C C C C C C C C H H H H H H H H H H H H H H H H H H
charge: -0.185191 -0.183611 -0.185202 -0.183691 -0.360883 -0.360891 -0.723082 0.529218 0.529206 0.480211 0.480213 0.180208 0.180386 0.180207 0.180338 0.064986 0.063523 0.065064 0.063626 -0.468368 -0.468350 -0.382972 -0.383003 -0.352384 -0.352435 -0.351590 -0.351627 -0.350284 -0.350243 -0.350273 -0.350246 -0.211898 -0.211817 -0.211897 -0.211814 0.230144 0.230145 0.235912 0.235911 0.246752 0.246756 0.268587 0.268615 0.268740 0.268778 0.271205 0.271308 0.271208 0.271307 0.239797 0.239803 0.239797 0.239803
chargesum: 0.00000
title: Mulliken charges with hydrogens summed into heavy atoms:
elementType: O O O O N N C C C C C C C C C C C C C C C C C C C C C C C C C C C C C
charge: -0.185191 -0.183611 -0.185202 -0.183691 -0.360883 -0.360891 -0.262793 0.529218 0.529206 0.480211 0.480213 0.180208 0.180386 0.180207 0.180338 0.064986 0.063523 0.065064 0.063626 -0.232456 -0.232439 -0.136220 -0.136247 -0.083796 -0.083820 -0.082850 -0.082849 -0.079079 -0.078935 -0.079065 -0.078940 0.027899 0.027986 0.027900 0.027988
polarizability: 5.29809571e+02 1.79733444e-02 2.60782416e+02 -2.41790594e+01 6.83170106e-02 3.11913422e+02
1716.lowfreq: -1.5787 -0.0010 0.0005 0.0011 1.7702 5.1472 8.4686 10.3825 14.5596
frequency: 8.2757 10.3468 14.5595 32.7383 45.8890 46.4485 52.8851 58.0803 83.4122 121.3353 133.6186 134.3328 137.6178 164.6041 167.5901 195.0375 205.8401 216.9705 239.5432 255.4678 255.8143 291.1413 324.2297 345.0989 346.9216 354.2310 358.8909 392.1194 398.4001 405.2412 407.1360 426.0313 427.9184 452.6076 452.6244 511.5566 518.0435 524.2564 524.3981 543.4130 557.2885 587.0497 612.7063 633.5360 633.5833 656.5889 656.6040 675.0271 681.2293 692.7761 695.3095 709.4216 710.1974 721.2075 729.7643 782.2744 783.5693 784.1204 794.2198 795.9806 807.5473 818.8817 833.9964 835.0035 837.5153 844.7270 849.4522 864.8067 868.3653 906.5687 906.5806 931.1133 956.8385 967.4702 972.8129 972.8406 974.9361 974.9481 1006.7887 1006.7946 1008.0562 1008.1006 1014.0607 1014.4580 1035.6962 1036.7395 1077.2879 1077.3935 1095.2471 1096.3988 1126.7302 1132.5765 1171.9735 1172.0136 1172.8949 1172.9301 1186.3147 1197.4442 1199.4096 1205.6908 1224.4361 1232.2861 1232.5323 1282.2548 1282.2611 1290.2838 1322.4464 1330.7084 1332.2963 1333.6383 1380.1444 1381.9168 1417.3778 1417.5253 1418.5446 1418.6674 1453.7169 1453.7217 1456.8295 1456.9266 1460.7691 1507.9220 1509.4916 1579.8675 1585.6151 1615.8216 1615.8671 1617.8155 1618.4596 1622.3420 1624.5295 1628.9534 1629.4907 1676.9093 1677.2509 2971.9532 3018.2659 3126.3682 3126.4888 3136.1760 3136.2809 3140.6588 3140.6668 3154.3738 3154.3809 3166.0644 3166.0694 3175.6284 3175.6500 3184.7133 3184.7331 3187.6807 3187.7428
redmass: 6.5097 6.9058 7.0377 6.9395 4.1021 6.5352 5.5379 5.4218 5.3347 7.4371 5.3603 5.0683 7.5191 8.7367 8.1097 6.3807 6.1636 5.2348 5.5596 7.8528 7.2021 5.2345 6.4379 8.6663 10.1819 6.2421 2.5961 3.7478 3.6930 2.8472 2.9001 4.1871 4.6420 4.8757 4.8753 3.5231 2.9654 7.3125 6.8632 8.2544 8.7708 8.5233 4.8829 7.1829 6.7108 4.8086 4.8087 5.7909 6.5989 6.6372 6.4864 3.3211 3.1651 3.0847 4.3508 3.0858 5.3916 4.3332 1.5860 1.7611 4.7418 1.6272 1.3099 2.3148 1.6976 5.0203 3.0112 6.4150 4.2655 1.3889 1.3889 1.5966 1.3852 1.5465 1.4429 1.3835 1.4102 1.4101 1.3488 1.3489 2.5263 2.5084 2.7820 2.7188 7.6648 7.2725 2.6908 2.6991 3.5304 3.3812 1.4194 1.3588 1.1208 1.1182 2.0613 2.0620 1.1674 1.5235 1.1293 1.6672 2.0165 3.6471 3.8746 1.5010 1.5010 1.6701 1.2878 1.4494 7.7035 7.1866 4.9331 6.5238 6.7903 6.7008 2.9085 2.9344 2.4646 2.4654 2.7295 2.7363 1.1078 2.6400 2.5634 7.1603 6.9790 7.8026 7.7792 7.2613 7.6250 6.7800 6.5108 11.6621 11.7399 12.7944 12.7653 1.0599 1.1004 1.0906 1.0906 1.0906 1.0904 1.0865 1.0865 1.0906 1.0906 1.0956 1.0956 1.1004 1.1004 1.0939 1.0939 1.0949 1.0949
irintensity: 0.1253 0.3019 0.2410 1.4530 1.0899 1.6352 2.3016 0.0023 2.4206 1.2846 0.2629 0.1926 2.8177 2.7875 1.3014 0.5691 0.0310 0.6031 2.3123 0.0822 6.8784 4.1072 1.3204 5.6380 14.6458 0.0358 2.1719 1.7802 2.6814 0.0629 0.5686 0.7497 0.0690 0.0003 0.0002 22.7647 22.0702 0.1883 26.9009 1.9029 2.8789 21.7930 0.3416 2.8005 1.5010 0.5812 0.2152 9.2637 13.1153 6.2304 0.3096 30.7502 77.3928 3.4274 0.9113 55.3880 1.5710 14.4814 35.8318 32.2166 20.4186 57.9882 1.3078 0.0703 0.2809 12.2869 20.8579 39.7977 13.0670 0.0401 0.0875 3.3370 0.2837 11.8520 6.0458 0.6871 1.9293 2.2963 0.0019 0.0017 1.0634 0.7736 2.2716 25.6613 0.0207 182.5443 0.1717 1.7498 5.4770 25.5841 12.8212 39.5188 7.0526 24.1974 0.1271 5.2286 2.0234 7.7185 1.0715 2.6317 0.4613 33.6986 156.7641 0.4372 0.4201 5.0352 0.0057 2.2247 724.1783 195.0501 1.4120 0.1302 45.0908 12.8773 18.7850 2.1293 0.5445 22.1708 5.6777 0.9120 19.4817 251.6596 43.0149 22.6972 2.3196 0.4418 122.4623 0.7462 0.6880 2.3769 0.4312 1.5049 659.1167 22.2139 14.8799 29.6523 10.1432 20.3910 13.8967 29.5499 0.4919 1.8405 1.9388 7.0541 4.9967 3.9448 6.2231 36.7918 12.2320 1.5799 1.9195 1.4574 0.0140
temp: 298.150 k
press: 1.00000 atm
elementType: 8 8 8 8 7 7 6 6 6 6 6 6 6 6 6 6 6 6 6 6 6 6 6 6 6 6 6 6 6 6 6 6 6 6 6 1 1 1 1 1 1 1 1 1 1 1 1 1 1 1 1 1 1
symmnumber: 1
zpe: 1031420.5 jmol-1
zpe.correction: 0.392847 hartree
zpe.thermalcorrener: 0.420257 hartree
zpe.thermalcorrenthalpy: 0.421201 hartree
zpe.thermalcorrgfe: 0.330213 hartree
zpe.sumelectzpe: -1524.004169 hartree
zpe.sumelectthermal: -1523.976760 hartree
zpe.sumelectthermalent: -1523.975816 hartree
zpe.sumelectthermalfe: -1524.066804 hartree
dipole: 0.0005 -2.6413 0.0005
dipole: 2.6413
quadrupole: -111.9934 -182.2678 -214.1315
quadrupole: 0.0123 -3.0105 -0.0199
quadrupole: 57.4708 -12.8036 -44.6673 0.0123 -3.0105 -0.0199
hfenergy: -1524.3970167 hartree
pointgroup: C01 [X(C29H18N2O4)]
dipole: -0.0002088 1.0391782 -0.0001103 debye
polarizability: 527.5620336|0.0268918|260.7823807|32.7002271|-0.0523985|314.1609949 unknown
InChI: InChI=1S/C29H18N2O4/c32-26-22-5-1-2-6-23(22)27(33)30(26)20-13-9-18(10-14-20)17-19-11-15-21(16-12-19)31-28(34)24-7-3-4-8-25(24)29(31)35/h1-16H,17H2
charge 0 multiplicity 1
53 atoms
O  -5.327764 -0.062842 -2.5418
O  -5.262277 0.286932 2.184309
O  5.329618 -0.065591 2.541833
O  5.261523 0.288313 -2.18393
N  -4.949137 -0.097175 -0.167999
N  4.95014 -0.098545 0.168127
C  0.000108 -3.146449 -0.00047
C  -1.287303 -2.326828 -0.060525
C  1.287726 -2.327177 0.059931
C  -3.721691 -0.847766 -0.129981
C  3.722479 -0.848762 0.129999
C  -6.86509 1.017394 -0.932398
C  -6.843741 1.125207 0.475936
C  6.865686 1.016664 0.932596
C  6.843679 1.125548 -0.475649
C  -5.666884 0.241016 -1.373403
C  -5.630645 0.421911 0.993458
C  5.668303 0.23895 1.373487
C  5.631414 0.420907 -0.993284
C  -2.293769 -2.623465 -1.011293
C  2.294181 -2.624567 1.010477
C  -1.524391 -1.269326 0.854775
C  1.52504 -1.269293 -0.854869
C  -3.504986 -1.901826 -1.049928
C  3.505588 -1.903262 1.049402
C  -2.722018 -0.530114 0.8244
C  2.722859 -0.530409 -0.82419
C  -7.894466 1.586813 -1.696811
C  -7.852219 1.805568 1.174907
C  7.894733 1.586612 1.697057
C  7.851022 1.807755 -1.174459
C  -8.920253 2.278402 -1.001394
C  -8.89964 2.385704 0.412937
C  8.919449 2.279939 1.001791
C  8.898099 2.38844 -0.412438
H  -0.033545 -3.813975 0.883662
H  0.033598 -3.813608 -0.884885
H  -2.133698 -3.433415 -1.733202
H  2.133955 -3.434857 1.731969
H  -0.755729 -1.012951 1.592691
H  0.75641 -1.012369 -1.592627
H  -4.264139 -2.143389 -1.79692
H  4.264743 -2.145436 1.796189
H  -2.886295 0.277074 1.541585
H  2.887343 0.277067 -1.541015
H  -7.89831 1.495886 -2.787381
H  -7.823816 1.881631 2.266246
H  7.899067 1.494889 2.787558
H  7.822124 1.884624 -2.265729
H  -9.741368 2.736777 -1.562753
H  -9.705289 2.925187 0.922215
H  9.740254 2.738815 1.563194
H  9.702922 2.929267 -0.921599
