program: Gaussian 09
title: 000261777
version: EM64L-G09RevD.01
frameworkgroup: C1[X(C13H9BrClN)]
method: RPBEPBE
basis: SDD
operation: Freq
keyword: #p
keyword: freq=noraman
keyword: PBEPBE/SDD
title: #p freq=noraman PBEPBE/SDD
converged: NO NO NO YES
title: Mulliken charges:
elementType: Br Cl N C C C C C C C C C C C C C H H H H H H H H H
charge: -0.012680 -0.067710 -0.683927 -0.702242 0.392544 0.250188 0.285297 0.165980 -0.669534 -0.475509 -0.424530 -0.380639 0.782979 -0.354431 -0.237648 -0.236783 0.262912 0.262908 0.264074 0.242566 0.237451 0.225897 0.226037 0.325009 0.321790
chargesum: 0.00000
title: Mulliken charges with hydrogens summed into heavy atoms:
elementType: Br Cl N C C C C C C C C C C C C C
charge: -0.012680 -0.067710 -0.037128 -0.176422 0.392544 0.250188 0.285297 0.165980 -0.669534 -0.211434 -0.181964 -0.143188 0.782979 -0.354431 -0.011751 -0.010746
polarizability: 2.84964550e+02 7.26369418e+00 2.03321548e+02 2.12131563e-02 -3.22473167e-03 6.64008224e+01
1716.lowfreq: -3.7811 -0.6033 -0.0010 0.0013 0.0015 4.9955 73.5178 82.1763 91.9125
frequency: 73.5145 82.1723 91.9122 113.6111 156.3706 188.4805 231.6273 242.0295 279.8923 282.3863 322.4386 346.3918 363.0915 429.1109 448.2776 467.8521 468.6485 494.7617 509.0471 570.7754 594.9899 603.1444 634.8945 696.9213 719.8453 733.2545 743.9220 769.3431 784.5502 829.5479 868.4042 877.8847 927.0060 961.0121 974.0345 984.8266 1013.8190 1029.6428 1066.5068 1101.0451 1130.8257 1163.7948 1170.2760 1190.9157 1208.0289 1242.3262 1290.3746 1335.0233 1366.3973 1387.2228 1425.1182 1441.1044 1458.5570 1463.6813 1481.5650 1560.1971 1590.8367 1604.4455 1620.3340 1635.1166 2984.5558 3027.7375 3120.0596 3126.2608 3140.7281 3160.3147 3161.0265 3537.7874 3682.9544
redmass: 5.5097 4.5554 7.2807 9.4133 15.2883 3.5303 4.4502 11.0357 2.7074 5.3908 11.0369 5.1459 5.4712 2.7306 1.1549 1.1184 4.4223 4.6963 3.4023 5.6784 4.2440 7.9527 4.4638 7.2371 2.7210 5.7526 3.0789 1.7632 6.2474 4.9023 1.3327 1.5005 1.7429 1.7377 3.1202 1.3261 3.9251 2.9997 1.7632 1.9755 1.1406 2.3235 1.3089 1.8661 1.5181 1.9693 1.5819 4.0781 4.9748 4.6142 1.1582 3.3409 4.1639 3.4205 4.6466 6.6790 6.5856 1.8943 6.8042 2.6309 1.0610 1.0990 1.0857 1.0896 1.0944 1.0988 1.0941 1.0446 1.1045
irintensity: 0.8268 0.3199 0.6121 0.3262 0.4848 3.0453 0.0078 0.5902 9.9236 3.8281 2.9837 8.8790 1.5499 25.7201 121.2075 137.4870 1.2162 0.1094 2.0724 3.3493 9.7161 24.1526 3.3778 35.0567 27.6869 14.8526 1.7338 73.2017 14.3755 3.7532 1.6521 14.3595 1.2075 8.3215 23.0373 0.0884 6.3102 40.1645 47.3246 11.8825 0.0578 20.1013 5.0012 0.1023 3.7494 15.3914 0.6953 16.8988 68.5675 4.8667 6.8011 19.9599 18.5592 132.0712 54.9496 29.1616 0.6249 38.0239 36.2501 265.3968 8.6032 4.9455 5.7708 2.6809 28.7586 29.4773 10.8224 128.3647 49.2118
temp: 298.150 k
press: 1.00000 atm
elementType: 35 17 7 6 6 6 6 6 6 6 6 6 6 6 6 6 1 1 1 1 1 1 1 1 1
symmnumber: 1
zpe: 477217.6 jmol-1
zpe.correction: 0.181763 hartree
zpe.thermalcorrener: 0.195215 hartree
zpe.thermalcorrenthalpy: 0.196159 hartree
zpe.thermalcorrgfe: 0.140885 hartree
zpe.sumelectzpe: -1027.985167 hartree
zpe.sumelectthermal: -1027.971715 hartree
zpe.sumelectthermalent: -1027.970770 hartree
zpe.sumelectthermalfe: -1028.026045 hartree
dipole: 0.3289 -0.6574 -0.0028
dipole: 0.7351
quadrupole: -91.4909 -104.2751 -114.8707
quadrupole: -0.1681 -0.0093 -0.0017
quadrupole: 12.0547 -0.7296 -11.3251 -0.1681 -0.0093 -0.0017
hfenergy: -1028.1669298 hartree
pointgroup: C01 [X(C13H9Br1Cl1N1)]
dipole: 0.0901366 -0.2748069 -0.0010819 debye
dipolederiv: -0.1940226 0.1653791 0.0000128 0.2517536 -0.6055935 0.0000686 0.0000754 -0.0001227 -0.0358916 -0.4831235 -0.3445007 0.0000543 -0.3820104 -0.5503569 0.0000568 0.0000299 0.0001158 -0.0643487 -1.7978675 0.1620856 -0.0006557 0.2946687 -0.2011914 0.0002141 -0.0019963 -0.0000721 -0.6646391 0.042398 -0.0389663 -0.0000294 -0.0009601 -0.077835 0.0000116 -0.0001488 0.0003074 0.1456917 0.0426738 -0.0406609 0.0001358 0.3355062 -0.1014648 0.0000079 0.0000307 -0.0000883 0.019291 -0.1830511 0.1180918 -0.0000697 -0.1280674 -0.1566364 -0.0000262 0.0000214 -0.0000727 -0.0237477 -0.1973195 -0.132527 -0.0000116 -0.3491629 0.0848364 -0.0000401 0.0000491 -0.0000803 -0.0465898 0.6185342 -0.1264895 0.0000714 0.1131318 -0.1429557 0.0000124 0.0000933 -0.0000493 0.004715 -0.1174315 -0.160518 -0.0001385 -0.7888122 1.0473845 -0.0001302 -0.0001051 0.0000996 -0.1832904 0.1921972 0.0945676 0.0000808 -0.101499 -0.0913981 0.0000107 -0.0000138 0.0002198 -0.0888241 0.1409945 0.0998298 0.0000262 0.1033005 0.0955945 0.0000109 -0.0000251 0.0000572 -0.1653553 -0.1612096 0.0641925 0.0000352 0.0752915 0.0840716 0.0000136 -0.0000799 0.0001343 -0.1591222 1.4535484 -0.1710477 0.0007249 -0.4859225 -0.4054905 -0.0001517 0.0009663 -0.0001082 0.1674511 0.1425564 0.3240259 -0.0001941 1.1477461 0.7453168 -0.0000196 -0.000097 -0.0002847 -0.1157535 -0.1245858 0.0186928 -0.0000149 0.1531095 -0.0381245 -0.0000485 0.0000407 -0.000107 -0.1744608 -0.0095434 -0.0661258 0.0000164 -0.1925548 0.0385549 -0.0000529 0.0000308 -0.000037 -0.1588322 0.0055573 0.0147509 -0.003804 -0.004892 0.0296228 0.0781769 -0.0042395 0.1084876 0.0061595 0.0055711 0.014746 0.0038168 -0.0047951 0.0294381 -0.0781683 0.0043685 -0.1087363 0.0061953 0.1028567 0.0568472 -0.0000078 0.0364664 -0.0186624 0.0000368 -0.0000417 0.0000988 0.1598007 0.0592661 -0.0348443 -0.0000052 -0.097024 -0.0948118 0.000018 0.0000214 -0.0000216 0.1535972 0.0725084 -0.0878106 -0.0000023 -0.0415794 -0.0813632 0.0000116 0.0000125 -0.0000184 0.1541972 -0.1489645 -0.0351217 -0.0000071 -0.0387736 0.0794534 0.0000067 -0.0000706 0.0000919 0.1631739 -0.0472074 0.1088 -0.0000567 0.1314923 -0.0350003 0.00006 -0.0000146 -0.0000045 0.158959 0.2811099 0.0025423 -0.0000278 -0.0661559 0.1821825 -0.0001463 0.0005006 0.0000037 0.3711931 0.3045545 -0.0059391 0.0000501 0.0397428 0.184429 0.0000674 0.0005919 0.0001872 0.3704308 unknown
polarizability: 285.3189453|-4.8684428|202.9671526|0.0205127|-0.0062949|66.4008224 unknown
InChI: InChI=1S/C13H9BrClN/c14-12-10-5-7-3-1-2-4-8(7)9(10)6-11(15)13(12)16/h1-4,6H,5,16H2
charge 0 multiplicity 1
25 atoms
Br 2.414419 -2.98984 0.000648
Cl 3.479846 2.627402 0.00004
N  4.13516 -0.326952 0.001257
C  -0.760316 -1.804071 0.000301
C  0.424644 -0.850428 0.000357
C  -0.033753 0.503885 0.000175
C  -1.955382 -0.85618 0.000088
C  -1.505971 0.500027 0.000013
C  1.795458 -1.118463 0.000565
C  0.893155 1.56822 0.000094
C  -3.328524 -1.153326 -0.000027
C  -2.435823 1.563954 -0.000167
C  2.775178 -0.075775 0.000634
C  2.259917 1.258915 0.000288
C  -4.262968 -0.086023 -0.000215
C  -3.817246 1.259798 -0.000283
H  -0.748841 -2.468337 0.886647
H  -0.748644 -2.46848 -0.885932
H  0.570946 2.613494 -0.000145
H  -3.679434 -2.192155 0.00003
H  -2.101375 2.607924 -0.000211
H  -5.337136 -0.302472 -0.000304
H  -4.551739 2.073218 -0.00042
H  4.47759 -1.284735 0.000373
H  4.791937 0.449897 0.000498
