program: Gaussian 09
title: 000261779
version: EM64L-G09RevD.01
frameworkgroup: C1[X(C13H7Br2Cl2N)]
method: RPBEPBE
basis: SDD
operation: Freq
keyword: #p
keyword: freq=noraman
keyword: PBEPBE/SDD
title: #p freq=noraman PBEPBE/SDD
converged: NO YES NO NO
title: Mulliken charges:
elementType: Br Br Cl Cl N C C C C C C C C C C C C C H H H H H H H
charge: 0.047949 0.053024 0.035393 -0.054658 -0.696041 -0.728282 0.055937 0.503572 0.288717 0.226891 0.588963 -0.523618 -0.407018 -0.332671 -0.509793 -0.105305 -0.102278 -0.256990 0.271841 0.271865 0.271595 0.207078 0.256170 0.314972 0.322685
chargesum: 0.00000
title: Mulliken charges with hydrogens summed into heavy atoms:
elementType: Br Br Cl Cl N C C C C C C C C C C C C C
charge: 0.047949 0.053024 0.035393 -0.054658 -0.058384 -0.184575 0.055937 0.503572 0.288717 0.226891 0.588963 -0.523618 -0.135423 -0.125592 -0.509793 -0.105305 -0.102278 -0.000820
polarizability: 3.42955008e+02 -4.92098520e-01 2.35528376e+02 6.93930646e-02 1.67962360e-01 7.25600016e+01
1716.lowfreq: -2.0357 -1.5003 0.0016 0.0016 0.0016 4.8652 34.4517 46.9288 69.8947
frequency: 34.4202 46.9271 69.8941 79.3860 90.7820 130.1017 151.3919 185.6510 203.0367 216.2017 221.5358 258.7646 261.6781 294.4671 303.5858 338.0733 361.0945 391.3737 401.7424 418.4928 425.4417 493.1442 514.8901 532.4397 593.5229 619.8104 626.1401 626.8686 632.8998 706.7039 712.8846 731.1195 774.2790 808.2188 849.3340 862.1286 873.6603 925.0079 951.4798 1005.9206 1032.8439 1074.0180 1078.0968 1132.3912 1139.8531 1188.6462 1214.3355 1241.9572 1277.8344 1303.4073 1348.6895 1369.9607 1412.9307 1418.5467 1423.5353 1436.8588 1463.6949 1572.3508 1577.7593 1579.9170 1609.4264 1631.8837 2990.9335 3034.3881 3140.4647 3157.6607 3171.9976 3552.1063 3719.7434
redmass: 7.2211 6.9088 8.4505 5.5500 22.3146 29.7156 7.5401 27.9567 17.0672 23.4168 2.8400 15.2923 4.5840 6.2845 2.4669 4.3950 2.5508 3.1019 8.5224 6.6116 2.2971 1.2300 3.3966 6.0576 4.9101 7.2958 6.4879 7.0265 7.0657 7.1164 3.7442 6.3040 2.0569 3.2744 6.2330 6.1398 1.4124 1.4032 2.1784 6.4506 3.4773 2.0046 2.3808 2.1645 1.1402 1.7759 1.5685 4.0457 1.4731 6.7722 6.0473 9.4773 3.1522 1.9228 2.4316 4.7092 3.1422 8.6716 4.9269 7.6493 6.9011 1.3735 1.0615 1.0988 1.0885 1.0933 1.0959 1.0493 1.0987
irintensity: 2.4941 0.2903 0.1748 0.7403 0.2974 0.2192 4.2582 0.0814 0.2652 1.0070 10.3564 1.0017 0.6304 3.5522 11.5939 10.0165 15.6845 35.4889 21.5940 5.7141 12.9193 156.0289 10.4762 1.5141 19.8579 16.2347 4.7667 3.2179 10.8815 29.5700 4.1008 11.5841 16.5509 41.3486 16.5298 24.3205 9.8273 1.3038 11.9191 3.3127 31.9229 20.0624 70.3637 10.8990 0.0021 24.5198 2.5952 35.1722 22.4589 20.9151 6.7585 2.4751 22.6320 48.2392 2.9870 198.2374 33.4010 23.5553 4.4450 17.2424 13.8760 236.4381 3.5370 2.4800 21.8728 1.2507 5.6961 68.0200 48.9918
temp: 298.150 k
press: 1.00000 atm
elementType: 35 35 17 17 7 6 6 6 6 6 6 6 6 6 6 6 6 6 1 1 1 1 1 1 1
symmnumber: 1
zpe: 424798.3 jmol-1
zpe.correction: 0.161797 hartree
zpe.thermalcorrener: 0.178354 hartree
zpe.thermalcorrenthalpy: 0.179298 hartree
zpe.thermalcorrgfe: 0.115236 hartree
zpe.sumelectzpe: -1500.150983 hartree
zpe.sumelectthermal: -1500.134426 hartree
zpe.sumelectthermalent: -1500.133482 hartree
zpe.sumelectthermalfe: -1500.197544 hartree
dipole: 1.4201 -2.5590 0.0598
dipole: 2.9273
quadrupole: -152.7405 -117.0107 -140.6866
quadrupole: 1.8836 -0.0281 -0.1641
quadrupole: -15.9279 19.8019 -3.8740 1.8836 -0.0281 -0.1641
hfenergy: -1500.3127799 hartree
pointgroup: C01 [X(C13H7Br2Cl2N1)]
dipole: -0.6054852 0.9789543 0.0375068 debye
dipolederiv: -0.0711715 0.0930935 0.0014093 0.2168068 -0.5657976 -0.0083123 0.0039007 -0.0079053 0.0065491 -0.3444447 -0.2695554 -0.0035769 -0.3439404 -0.3437876 -0.0053822 -0.0061115 -0.0071308 0.0123096 -0.7795288 0.1644043 0.004697 0.1858057 -0.0544284 -0.0012561 0.0065469 -0.0005608 -0.0119182 -1.0605361 -0.0914915 0.0004682 -0.1635312 -0.1386132 -0.0002597 0.0002406 -0.0002377 -0.0675786 -0.2343694 0.3375246 -0.0026494 0.0191065 -1.3674529 -0.0070247 -0.0098713 0.0070544 -0.6468338 0.0238537 -0.0472458 0.0001839 -0.0284448 -0.1226457 -0.0025589 -0.0005114 -0.003104 0.1224002 -0.0935429 -0.1006861 -0.001092 0.3072457 -0.2518239 -0.0037122 0.0093112 -0.0026398 -0.0544871 0.2364172 0.1573055 0.0010281 -0.0697451 -0.1239899 -0.0024284 -0.0025185 -0.0030954 0.0441452 -0.101801 -0.1458737 -0.0021938 -0.2338976 0.1280703 0.0020262 -0.003757 0.002681 -0.0257694 0.5435616 -0.0696206 0.0004804 0.0731651 -0.1779099 -0.0018757 0.0015696 -0.0010482 0.0151167 -0.1443403 -0.5270864 -0.0067746 -0.2394204 1.1753075 0.0153309 -0.003184 0.0202803 0.1803807 -0.5289046 -0.3450202 -0.0040264 -0.4450533 0.8267138 0.0135237 -0.0061322 0.0148423 -0.1839011 -0.2228168 0.0984815 0.0012956 0.0365433 0.0180274 0.0011235 0.0010862 0.0010529 -0.123658 0.0309458 0.0336894 -0.0013982 0.0424584 0.1075122 -0.0002424 -0.0022107 -0.004062 -0.1625409 0.4409827 0.9719592 0.0154521 0.4895425 0.1725971 0.0063723 0.0079502 0.0006991 -0.1890405 0.860972 -0.2597438 -0.0081254 0.0909565 0.0985617 0.0009397 -0.0043828 0.0008934 0.0471384 1.3044379 0.1230805 -0.0012419 0.4273284 0.1727237 0.0011264 -0.0001098 0.001566 -0.0678309 -0.4339675 -0.0756333 0.0006794 -0.2975486 -0.0481025 -0.0004487 -0.0014025 -0.0005738 -0.116661 0.0091186 0.0081961 0.0014139 -0.0136586 0.0479733 0.0708262 0.0011455 0.0950019 0.0197811 0.0098011 0.0080787 -0.0019036 -0.0143284 0.051461 -0.0700404 -0.0017601 -0.0940654 0.0163964 0.080636 -0.0256138 -0.0001491 -0.0583534 -0.0173074 -0.001294 -0.0000912 -0.0015607 0.161563 0.0433695 -0.1104614 -0.0012014 -0.0876637 -0.1087259 -0.0011749 -0.0010152 0.0009605 0.1561789 0.0115074 0.0706852 0.0003099 0.0754847 0.0202148 -0.0004804 0.0004631 -0.0004443 0.1673883 0.1698826 0.0081183 0.0060824 0.0336552 0.2360965 -0.0015229 0.0112785 -0.0100403 0.3461348 0.2499376 -0.0065849 0.0008326 -0.0025134 0.2653258 -0.0032552 -0.0004342 -0.0085634 0.354737 unknown
polarizability: 342.7629526|4.5648004|235.6940712|-0.2187656|2.0700959|72.5863624 unknown
InChI: InChI=1S/C13H7Br2Cl2N/c14-10-8-4-5-3-6(16)1-2-7(5)9(8)13(18)11(15)12(10)17/h1-3H,4,18H2
charge 0 multiplicity 1
25 atoms
Br 2.456996 -3.277065 -0.033533
Br 4.021293 2.381884 0.04516
Cl 4.755916 -0.839938 -0.010652
Cl -5.762455 -0.36675 0.014496
N  0.945394 2.752474 0.057743
C  -0.56188 -1.885126 -0.004932
C  0.281861 0.3791 0.017916
C  0.66459 -0.992635 0.001278
C  -1.705022 -0.887461 0.007312
C  -1.195984 0.452007 0.017625
C  1.273466 1.408267 0.033921
C  2.011948 -1.377997 -0.007056
C  -3.082088 -1.15541 0.006217
C  -2.114286 1.531771 0.021475
C  2.642993 0.990666 0.024346
C  3.012536 -0.373782 0.002586
C  -3.965465 -0.055339 0.014361
C  -3.505433 1.275656 0.020464
H  -0.578909 -2.559075 0.873431
H  -0.583819 -2.540512 -0.897166
H  -3.466238 -2.179809 -0.001326
H  -1.80562 2.581272 0.018618
H  -4.221127 2.102696 0.023186
H  -0.019437 3.056322 0.0944
H  1.683967 3.45288 0.074129
