program: Gaussian 09
title: 000261778
version: EM64L-G09RevD.01
frameworkgroup: C1[X(C13H7BrClNO)]
method: RPBEPBE
basis: SDD
operation: Freq
keyword: #p
keyword: freq=noraman
keyword: PBEPBE/SDD
title: #p freq=noraman PBEPBE/SDD
converged: YES YES NO YES
title: Mulliken charges:
elementType: Br Cl O N C C C C C C C C C C C C C H H H H H H H
charge: 0.014360 -0.050524 -0.150185 -0.691645 0.293699 0.302229 0.260425 0.205476 -0.313202 -0.369828 -0.616087 -0.388632 -0.395253 0.707137 -0.499737 -0.199816 -0.103901 0.261473 0.277934 0.251490 0.300735 0.257826 0.326124 0.319902
chargesum: 0.00000
title: Mulliken charges with hydrogens summed into heavy atoms:
elementType: Br Cl O N C C C C C C C C C C C C C
charge: 0.014360 -0.050524 -0.150185 -0.045619 0.293699 0.302229 0.260425 0.205476 -0.313202 -0.108354 -0.338153 -0.137142 -0.094517 0.707137 -0.499737 0.058010 -0.103901
polarizability: 3.49732087e+02 -1.44651410e+01 1.91889143e+02 1.61224725e-03 3.61538958e-03 6.19916138e+01
1716.lowfreq: -2.1970 0.0016 0.0020 0.0025 1.9788 5.0030 46.6694 67.3103 92.8322
frequency: 46.6680 67.3069 92.8311 128.6164 153.0230 182.6268 204.4597 219.2314 242.1293 258.2690 290.5428 318.2398 376.4754 418.6925 424.3340 429.0742 437.1836 464.3445 470.9075 500.7663 544.6575 592.3267 614.2814 630.3077 656.5476 708.7105 729.1632 744.0098 759.4511 814.3906 834.7406 872.7324 893.4916 902.3466 930.0114 956.6085 978.8359 1002.7031 1043.7492 1056.0710 1091.6763 1128.5928 1171.5362 1207.4062 1248.4979 1261.4267 1309.3801 1358.1771 1370.5229 1419.7952 1440.5856 1465.4118 1488.3401 1576.6334 1589.4024 1598.7284 1621.9903 1633.4633 1645.1183 3137.9951 3143.8721 3159.5767 3168.0664 3172.1637 3546.4280 3692.0336
redmass: 9.6470 7.2840 14.9618 6.4830 6.3749 13.1645 4.7311 17.9781 6.2181 6.5920 7.4997 7.0553 4.5599 1.9973 1.5024 5.7132 2.8359 1.2323 5.2055 4.4282 5.8785 6.5026 5.1651 7.7340 8.1511 5.4468 6.6905 6.6229 3.1288 3.2832 1.4396 7.6512 1.5516 1.5113 1.8627 1.4048 3.8135 3.4914 1.7536 1.7954 3.7912 1.9955 2.7125 2.2218 1.2731 1.4418 4.4506 9.2361 3.1599 4.2305 2.7743 7.3547 5.0029 8.4632 8.0727 8.2819 2.3903 2.7516 3.6566 1.0923 1.0898 1.0926 1.0935 1.0958 1.0458 1.1034
irintensity: 0.0610 3.9834 0.2938 0.9019 1.6818 0.4479 0.3209 1.5017 3.5968 1.2115 5.8142 0.9185 2.5220 59.3703 3.0536 23.0300 23.3959 233.7160 2.1457 5.6847 6.4083 7.4577 3.9528 1.9851 5.7804 4.2056 8.7060 72.8070 0.0120 30.2080 34.4207 12.9591 4.9202 7.4715 33.2205 1.8829 61.9237 0.4011 18.9091 4.1263 66.9520 11.6781 100.3569 1.3018 8.2832 17.7797 44.8563 7.9803 21.8249 64.7244 76.7543 229.5361 111.5215 46.9731 15.2406 129.2817 72.5505 194.5860 165.4086 7.4586 6.3503 1.3775 0.3090 5.6138 146.0973 38.0133
temp: 298.150 k
press: 1.00000 atm
elementType: 35 17 8 7 6 6 6 6 6 6 6 6 6 6 6 6 6 1 1 1 1 1 1 1
symmnumber: 1
zpe: 428488.5 jmol-1
zpe.correction: 0.163203 hartree
zpe.thermalcorrener: 0.177314 hartree
zpe.thermalcorrenthalpy: 0.178258 hartree
zpe.thermalcorrgfe: 0.121083 hartree
zpe.sumelectzpe: -1101.948897 hartree
zpe.sumelectthermal: -1101.934785 hartree
zpe.sumelectthermalent: -1101.933841 hartree
zpe.sumelectthermalfe: -1101.991017 hartree
dipole: -4.3596 -1.1258 -0.0012
dipole: 4.5026
quadrupole: -110.6278 -108.2288 -118.2199
quadrupole: -16.1519 0.0053 -0.0086
quadrupole: 1.7310 4.1300 -5.8610 -16.1519 0.0053 -0.0086
hfenergy: -1102.1120994 hartree
pointgroup: C01 [X(C13H7Br1Cl1N1O1)]
dipole: -1.6298897 0.6939333 0.0001662 debye
dipolederiv: -0.522508 0.3104763 -0.0002096 0.4033172 -0.3520579 0.0000591 -0.0005686 0.0004362 -0.0235195 -1.0903617 0.0200821 -0.0000489 0.0677666 -0.1163748 0.0000227 -0.0001807 0.000113 -0.0633236 -0.5533143 0.0828913 -0.0000782 0.1331565 -1.0842619 0.0002893 -0.0001748 0.0002859 -0.296466 -1.7154504 -0.5043902 0.0001648 -0.5755814 -0.2908228 -0.0010555 -0.0014243 -0.0014649 -0.6926838 -0.3295392 -0.1584531 -0.0000507 -0.0514256 -0.1314694 -0.0000766 -0.000632 0.0001961 -0.0460761 0.7694761 0.2417268 -0.000068 0.1455723 0.0231275 0.0001166 0.0002408 -0.0001479 0.0025597 -0.6272166 0.4861632 -0.0000593 0.1922214 -0.03172 -0.0001087 -0.0002572 0.0003644 0.0537103 -0.6674959 -0.2620911 -0.0000126 -0.1153097 -0.2273992 0.0000391 -0.00019 0.0000952 0.0296047 1.37101 -0.1076374 0.0001961 -0.0354139 1.3180841 -0.000456 0.000457 -0.0004588 0.1087798 0.0577018 0.1172338 -0.000078 0.2357095 -0.0307046 0.0001242 0.0000448 -0.000034 -0.0491545 -0.1845508 -0.4270268 0.0000514 0.3888102 0.1277897 0.0002355 -0.0002279 -0.0002832 -0.1698022 -0.3285099 -0.1832372 0.0000681 -0.1982212 0.0443817 0.0000137 0.0001378 -0.0000574 -0.1480445 -0.1047825 0.0473664 0.0000213 -0.1019776 0.0586275 -0.0000821 -0.0000294 0.0000284 -0.0698508 1.4088161 0.7953391 -0.0000255 0.8494231 -0.0629326 0.0003616 0.0004601 0.0005296 0.1698657 0.4519322 -0.6059623 0.0003937 -1.3663965 0.4124823 -0.0003127 0.0016614 -0.0006642 -0.1945657 -0.1865076 0.11313 0.0000094 0.1284177 0.0054721 -0.0000578 -0.0000752 -0.0000304 -0.0828648 1.420603 -0.0431041 0.0000132 -0.161633 0.0272738 -0.0000473 0.0003183 -0.0001826 -0.0929969 0.112201 -0.0404985 -0.0000085 -0.0192454 -0.0309977 0.0000464 -0.0001733 0.000158 0.1517222 0.038947 -0.0140879 -0.000005 -0.0520289 -0.0279779 -0.0000274 -0.0000773 -0.0000141 0.1703442 0.0414538 0.0875347 -0.0000014 0.0509715 -0.044506 0.0000153 -0.000006 0.0000349 0.1553235 0.0943693 0.0169555 -0.0000207 0.0593399 0.037678 0.0000804 0.000054 -0.0000318 0.1661634 0.0268849 -0.0715971 0.0000208 -0.0767106 0.0168636 0.00008 -0.0000463 0.0000989 0.1616047 0.2864632 0.0381316 -0.0000625 -0.0306558 0.1918169 0.0003398 -0.0001433 0.0003015 0.3779533 0.2303784 0.0610546 -0.0002101 0.1298936 0.1676277 0.0004002 0.0008322 0.0007271 0.3817171 unknown
polarizability: 350.4857371|-9.4717254|191.1354825|0.0216704|-0.032697|61.9916232 unknown
InChI: InChI=1S/C13H7BrClNO/c14-11-4-8-7-2-1-6(15)3-9(7)13(17)10(8)5-12(11)16/h1-5H,16H2
charge 0 multiplicity 1
24 atoms
Br -4.415915 2.225602 -0.000856
Cl 5.515612 0.195434 0.000408
O  0.576485 -2.935813 0.001001
N  -4.568979 -0.930217 -0.000224
C  -0.561965 0.48811 0.000079
C  0.910667 0.660598 -0.000005
C  -0.857987 -0.908131 0.000221
C  1.515628 -0.634961 0.000445
C  0.433872 -1.682953 0.000561
C  -1.617968 1.414215 -0.000168
C  -2.164727 -1.394564 0.000096
C  1.72382 1.808556 -0.000399
C  2.906661 -0.812075 0.000622
C  -3.261733 -0.471718 0.000251
C  -2.942457 0.922904 0.000001
C  3.134997 1.65082 -0.000231
C  3.699394 0.357559 0.000282
H  -1.440781 2.493568 -0.000561
H  -2.352335 -2.47437 -0.000211
H  1.29593 2.816377 -0.000743
H  3.348768 -1.812524 0.000934
H  3.78951 2.5274 -0.000501
H  -5.347975 -0.275462 -0.001386
H  -4.765223 -1.926952 0.002086
