program: Gaussian 09
title: 000261770
version: EM64L-G09RevD.01
frameworkgroup: C1[X(C13H8Cl2O)]
method: RPBEPBE
basis: SDD
operation: Freq
keyword: #p
keyword: freq=noraman
keyword: PBEPBE/SDD
title: #p freq=noraman PBEPBE/SDD
converged: NO YES NO NO
title: Mulliken charges:
elementType: Cl Cl O C C C C C C C C C C C C C H H H H H H H H
charge: -0.052082 -0.052080 -0.427765 -0.320353 0.205868 0.205758 0.198174 0.198029 -0.374588 -0.374526 -0.378705 -0.378662 -0.103305 -0.103291 -0.213285 -0.213338 0.259296 0.285744 0.285778 0.247456 0.247446 0.257575 0.257570 0.343288
chargesum: 0.00000
title: Mulliken charges with hydrogens summed into heavy atoms:
elementType: Cl Cl O C C C C C C C C C C C C C
charge: -0.052082 -0.052080 -0.084477 -0.061057 0.205868 0.205758 0.198174 0.198029 -0.088844 -0.088749 -0.131250 -0.131216 -0.103305 -0.103291 0.044290 0.044232
polarizability: 2.94551665e+02 1.85680815e-04 1.52668700e+02 -3.73989841e-03 -6.51288465e+00 6.79761896e+01
1716.lowfreq: -3.7364 0.0010 0.0012 0.0017 3.0674 10.5008 40.0846 102.7577 106.8841
frequency: 40.0824 102.7560 106.8824 124.0027 135.5365 198.9983 225.4288 236.7397 261.2472 331.3715 362.6139 374.8358 380.7455 390.7459 446.0807 448.9281 523.2531 534.7650 564.8874 565.5286 607.1380 668.9746 669.8758 718.5014 756.3251 763.0507 821.1385 828.3467 838.7329 880.2698 902.7757 905.3585 955.6019 957.0482 974.7800 994.9529 1061.0164 1063.3218 1110.2838 1124.9773 1173.4517 1176.3979 1194.5777 1205.8787 1230.2897 1265.9646 1288.9437 1354.6588 1365.6285 1368.7736 1415.6528 1424.6823 1443.1534 1475.7605 1585.6053 1585.6764 1610.5280 1610.6804 3026.7274 3139.7349 3142.3776 3164.0635 3164.3763 3170.6032 3171.1535 3542.5605
redmass: 14.8820 6.7071 8.5219 6.2565 4.6998 7.0352 7.1561 14.3222 5.0999 5.9197 4.3127 1.4235 3.8630 6.1914 3.2941 3.5173 6.4850 4.9729 6.3692 3.4495 6.3143 7.4371 4.9425 5.8125 3.4550 5.0775 1.6434 2.7058 1.6354 2.6639 1.7504 1.4834 1.3930 1.3521 6.1249 7.0170 1.8493 2.1471 2.0972 1.6858 1.8298 2.1978 1.5900 1.2931 1.6934 1.3132 2.0636 1.1842 10.7276 3.3947 3.7214 4.5220 2.5220 4.6117 8.2838 8.0772 7.9734 7.4183 1.0832 1.0898 1.0897 1.0933 1.0934 1.0960 1.0961 1.0663
irintensity: 0.0936 0.0009 0.6573 0.0776 0.0932 0.0103 0.5513 0.0320 0.7910 1.7628 4.7366 60.7665 1.3000 83.3805 1.9197 29.3985 2.6203 0.6346 1.4900 3.8485 14.2210 37.0533 2.3139 1.6098 2.7686 18.6063 111.2977 3.2754 0.1822 22.6755 9.6233 15.8126 0.0915 0.2709 70.4970 14.4065 56.5252 12.6368 2.3415 3.1273 58.3348 22.6091 3.8377 23.4099 0.9090 15.1395 0.4557 31.9113 6.1628 1.0492 95.4333 7.6042 87.3788 1.0659 14.3282 4.3242 11.3672 0.9737 6.5836 3.2669 9.3638 0.5370 0.1645 3.1840 7.2637 10.1433
temp: 298.150 k
press: 1.00000 atm
elementType: 17 17 8 6 6 6 6 6 6 6 6 6 6 6 6 6 1 1 1 1 1 1 1 1
symmnumber: 1
zpe: 444148.3 jmol-1
zpe.correction: 0.169167 hartree
zpe.thermalcorrener: 0.182250 hartree
zpe.thermalcorrenthalpy: 0.183195 hartree
zpe.thermalcorrgfe: 0.128789 hartree
zpe.sumelectzpe: -1494.436090 hartree
zpe.sumelectthermal: -1494.423007 hartree
zpe.sumelectthermalent: -1494.422063 hartree
zpe.sumelectthermalfe: -1494.476468 hartree
dipole: -0.0003 -2.4139 0.5022
dipole: 2.4656
quadrupole: -121.8895 -99.3338 -105.7655
quadrupole: -0.0001 -0.0002 -1.3276
quadrupole: -12.8932 9.6625 3.2308 -0.0001 -0.0002 -1.3276
hfenergy: -1494.6052573 hartree
pointgroup: C01 [X(C13H8Cl2O1)]
dipole: -0.0066937 -0.9410594 0.2352924 debye
dipolederiv: -1.0275151 -0.1009016 0.0106085 -0.172171 -0.1406913 0.0096699 0.0008986 0.0066157 -0.0678766 -1.0223132 0.1165392 0.0037414 0.1879592 -0.1458044 0.007044 0.0135577 0.0048608 -0.0679105 -0.596924 -0.00257 -0.0001024 -0.0018267 -0.6228393 -0.236483 -0.0010073 -0.3393055 -0.3097036 0.4626001 0.0021833 0.0011832 0.001516 0.5156778 0.1710337 0.001911 0.2673562 0.4259635 -0.1785776 0.007437 0.0207313 -0.0855143 -0.0280038 -0.0612521 0.0305937 -0.048098 -0.0980696 -0.1779135 -0.0054212 -0.0206576 0.0872818 -0.0292967 -0.0620791 -0.0305217 -0.0473612 -0.0973777 0.2641862 -0.0972121 0.0179988 0.066718 -0.0846922 0.0041237 -0.0320596 0.0030038 0.0085993 0.2647187 0.0911451 -0.0214819 -0.0727372 -0.0851675 0.0054578 0.028788 0.0010969 0.0084794 -0.2876308 0.0346334 -0.0099408 0.0854424 0.0123379 -0.022512 -0.033593 -0.0099308 -0.0915021 -0.288982 -0.029501 0.0125193 -0.0804103 0.0142453 -0.0215747 0.0365682 -0.0101926 -0.0921734 -0.0024225 0.0646426 0.0000229 -0.0068769 0.0870211 -0.0384577 0.0125655 -0.0269198 -0.1351084 -0.0035906 -0.0634511 -0.0026728 0.0079059 0.0880378 -0.0385455 -0.0152541 -0.0257038 -0.1349105 1.322104 0.1571143 -0.00644 0.3492061 0.1580079 -0.0308641 -0.010743 -0.0252311 -0.0717236 1.3126712 -0.1779281 -0.0149132 -0.3701406 0.1673913 -0.0254137 -0.0108628 -0.0226718 -0.071672 -0.3488954 -0.1068933 0.0156301 -0.2573243 -0.0523656 -0.013549 0.0318415 -0.01211 -0.1001507 -0.3430724 0.1118675 -0.0121523 0.2622415 -0.0588369 -0.0170641 -0.0280873 -0.0131457 -0.0995373 0.0040617 -0.0000102 0.0003084 0.000369 -0.0072593 0.0644268 -0.0001964 0.008071 -0.035799 0.0893001 -0.0237765 0.0011257 -0.0527342 0.0150875 0.0247756 0.0057896 0.0214464 0.1561829 0.0905441 0.0227794 0.0002829 0.0517751 0.0137722 0.0240177 -0.0043437 0.0211836 0.1562616 0.0583127 -0.0785459 0.0106155 -0.0448511 -0.0564803 0.0294159 0.0051079 0.0315669 0.1488113 0.0602348 0.0769549 -0.0088014 0.0432191 -0.0586555 0.028899 -0.0033107 0.0304966 0.1490194 0.0089016 0.074405 -0.0129742 0.0725657 0.0303362 0.0208476 -0.0162384 0.0217769 0.1610972 0.0068222 -0.0736642 0.015551 -0.0718409 0.0328822 0.0216041 0.0189092 0.0224931 0.1606577 0.3333797 0.0001736 -0.0001823 0.000228 0.2352956 0.1564791 -0.000313 0.1407023 0.0984428 unknown
polarizability: 294.5272999|-1.325242|152.0269014|-1.7385314|-9.8532644|68.642353 unknown
InChI: InChI=1S/C13H8Cl2O/c14-7-1-3-9-10-4-2-8(15)6-12(10)13(16)11(9)5-7/h1-6,13,16H
charge 0 multiplicity 1
24 atoms
Cl 5.294709 0.24484 -0.080349
Cl -5.219629 0.337376 -0.003101
O  0.062498 2.797803 0.446554
C  0.046263 1.604094 -0.416379
C  1.231037 0.65109 -0.229947
C  -1.152142 0.671802 -0.213166
C  0.768857 -0.683118 -0.028166
C  -0.710511 -0.670258 -0.017726
C  2.599244 0.958788 -0.251766
C  -2.514875 1.003455 -0.21492
C  1.6948 -1.734326 0.141383
C  -1.652265 -1.705117 0.16496
C  3.505961 -0.109656 -0.069416
C  -3.437499 -0.048859 -0.019143
C  3.079732 -1.44207 0.120314
C  -3.032041 -1.388652 0.164027
H  0.042886 2.039457 -1.432558
H  2.952909 1.983808 -0.395895
H  -2.852622 2.034517 -0.3539
H  1.365722 -2.767906 0.292262
H  -1.339212 -2.744354 0.310986
H  3.819051 -2.237463 0.253148
H  -3.783162 -2.171053 0.307458
H  0.066192 2.503403 1.394239
