program: Gaussian 09
title: 000261768
version: EM64L-G09RevD.01
frameworkgroup: C1[X(C15H9F4NO)]
method: RPBEPBE
basis: SDD
operation: Freq
keyword: #p
keyword: freq=noraman
keyword: PBEPBE/SDD
title: #p freq=noraman PBEPBE/SDD
converged: NO YES NO NO
title: Mulliken charges:
elementType: F F F F O N C C C C C C C C C C C C C C C H H H H H H H H H
charge: -0.163352 -0.170971 -0.149545 -0.151265 -0.254657 -0.453549 -0.663599 0.325408 0.196601 0.169138 0.173989 -0.568851 -0.363775 0.011918 0.049484 0.531232 -0.481526 0.042835 0.084519 0.216287 -0.798373 0.267394 0.267393 0.324170 0.269655 0.224840 0.314749 0.238969 0.271903 0.238980
chargesum: 0.00000
title: Mulliken charges with hydrogens summed into heavy atoms:
elementType: F F F F O N C C C C C C C C C C C C C C C
charge: -0.163352 -0.170971 -0.149545 -0.151265 -0.254657 -0.138801 -0.128812 0.325408 0.196601 0.169138 0.173989 -0.244680 -0.094120 0.011918 0.049484 0.531232 -0.256686 0.042835 0.084519 0.216287 -0.048522
polarizability: 3.25953354e+02 2.73650097e+00 1.79595002e+02 6.26379401e-04 1.02914380e-03 7.52834620e+01
1716.lowfreq: -71.6217 -4.4800 -3.4033 -0.0006 0.0004 0.0010 3.8331 36.7755 55.6006
frequency: -71.6196 36.7716 55.5941 84.2574 86.6702 109.4734 132.3320 152.7071 154.0883 195.9748 231.5127 233.0451 256.3317 263.4954 300.5106 301.8227 305.3988 358.0389 379.9391 403.3756 410.2751 432.5009 462.5734 468.4852 542.0552 545.9326 565.8467 583.5665 609.1170 638.0765 641.0100 649.6896 662.5559 723.8765 734.5980 763.1316 771.5691 827.7467 831.4311 908.1080 917.1534 924.7993 937.7661 954.5261 968.9414 985.5809 997.8434 1032.1331 1063.9939 1103.0239 1134.5807 1155.8705 1169.8332 1213.4551 1227.2914 1252.4356 1273.0556 1285.8696 1336.2706 1371.8585 1377.6538 1409.2957 1423.1625 1440.9908 1447.0161 1451.0312 1461.2424 1468.6027 1495.3885 1511.1205 1591.5282 1601.4476 1629.0846 1635.3059 1637.2466 2988.5641 2997.5217 3042.5374 3073.3396 3119.1051 3138.7780 3170.0528 3184.2730 3521.3194
redmass: 1.0435 6.6606 6.7064 5.1857 6.9372 5.5644 8.2976 13.1774 8.7948 6.0382 6.8837 2.4245 17.5844 13.7389 6.7055 6.8618 11.0294 5.6165 5.8389 8.3793 7.1565 2.9266 7.7610 10.5161 5.0509 3.3530 6.1129 3.4303 5.6319 6.3186 5.1054 1.2129 6.4708 5.1146 9.2703 5.4206 5.6583 7.3393 1.5227 1.6650 7.0302 5.7852 3.4984 1.3869 1.7284 4.7837 2.0047 1.6627 7.6949 3.4806 1.1363 1.5262 3.2226 1.5763 2.8464 3.0445 3.9241 1.4636 7.8239 4.7749 1.2809 5.3859 1.2901 2.7058 1.7566 4.2757 3.6274 1.0465 4.4440 2.0572 7.2747 9.4474 6.5418 5.4911 11.1986 1.0385 1.0612 1.0993 1.0983 1.0900 1.0978 1.0953 1.0937 1.0764
irintensity: 0.0685 0.4443 9.9419 1.8311 2.3873 0.4593 0.7257 0.0957 1.9104 0.2427 4.0740 7.3611 0.1258 1.8217 0.8052 1.3840 2.5735 2.1024 8.8095 0.1892 0.3709 8.9467 2.4189 2.1958 0.6607 4.1295 9.5483 0.5439 5.4963 7.2272 9.1886 56.2013 19.1076 2.9088 3.5531 0.9390 5.6242 45.2514 60.7199 8.7161 76.3275 15.8477 5.1403 1.3282 20.6852 25.8335 69.5602 8.0570 11.5987 16.7113 0.3692 10.3515 0.9337 0.7719 103.7836 58.1110 86.1475 20.1513 35.1001 99.3059 86.2840 219.5851 4.0815 112.1153 196.8139 56.4784 148.5139 20.4164 184.4368 179.8411 70.6007 19.5737 88.8803 117.9590 3.8358 7.9976 3.2059 2.3309 14.0713 21.2172 6.5998 3.4056 7.9268 15.3725
temp: 298.150 k
press: 1.00000 atm
elementType: 9 9 9 9 8 7 6 6 6 6 6 6 6 6 6 6 6 6 6 6 6 1 1 1 1 1 1 1 1 1
symmnumber: 1
zpe: 537933.0 jmol-1
zpe.correction: 0.204888 hartree
zpe.thermalcorrener: 0.222078 hartree
zpe.thermalcorrenthalpy: 0.223022 hartree
zpe.thermalcorrgfe: 0.159607 hartree
zpe.sumelectzpe: -1104.888231 hartree
zpe.sumelectthermal: -1104.871041 hartree
zpe.sumelectthermalent: -1104.870097 hartree
zpe.sumelectthermalfe: -1104.933511 hartree
dipole: 6.2447 2.7435 0.0004
dipole: 6.8208
quadrupole: -116.1055 -122.4570 -118.1179
quadrupole: 18.8248 0.0022 -0.0001
quadrupole: 2.7880 -3.5635 0.7756 18.8248 0.0022 -0.0001
hfenergy: -1105.0931184 hartree
pointgroup: C01 [X(C15H9F4N1O1)]
dipole: 2.45587 -1.0816364 0.0009617 debye
polarizability: 325.9481741|-2.8716707|179.6000334|-0.0141406|-0.1242334|75.2836112 unknown
InChI: InChI=1S/C15H9F4NO/c1-6(21)20-8-2-3-9-7(4-8)5-10-11(9)13(17)15(19)14(18)12(10)16/h2-4,20H,5H2,1H3
charge 0 multiplicity 1
30 atoms
F  -3.039666 2.883311 -0.003307
F  -2.238194 -2.677832 0.00342
F  -5.222402 1.135509 -0.00103
F  -4.816774 -1.622447 0.002308
O  4.934476 1.692334 -0.00222
N  4.385441 -0.592347 0.000341
C  -0.183703 1.720906 -0.002079
C  0.822165 0.575315 -0.00077
C  0.143408 -0.680956 0.000795
C  -1.515861 0.990904 -0.001102
C  -1.302839 -0.42344 0.000596
C  2.221323 0.654854 -0.000979
C  0.881542 -1.886334 0.00218
C  -2.813712 1.50235 -0.001638
C  -2.409448 -1.288175 0.001726
C  2.964067 -0.560621 0.00042
C  2.286931 -1.815714 0.001978
C  -3.925709 0.629213 -0.000504
C  -3.719157 -0.766076 0.001182
C  5.289964 0.478894 -0.00088
C  6.75514 0.042083 -0.000532
H  -0.072551 2.375462 0.883286
H  -0.072666 2.373322 -0.889036
H  2.753101 1.607896 -0.002167
H  0.377789 -2.856771 0.00339
H  2.872153 -2.744301 0.003048
H  4.801374 -1.527163 0.00134
H  6.994976 -0.560065 0.895566
H  7.388269 0.940414 -0.001461
H  6.994863 -0.561825 -0.895476
