program: Gaussian 09
title: 000261766
version: EM64L-G09RevD.01
frameworkgroup: C1[X(C14H10Br2)]
method: RPBEPBE
basis: SDD
operation: Freq
keyword: #p
keyword: freq=noraman
keyword: PBEPBE/SDD
title: #p freq=noraman PBEPBE/SDD
converged: YES YES NO NO
title: Mulliken charges:
elementType: Br Br C C C C C C C C C C C C C C H H H H H H H H H H
charge: -0.013382 0.004783 -0.559231 0.419870 0.419660 0.183879 0.183999 -0.666457 -0.388478 -0.388463 -0.392545 -0.392582 -0.242662 -0.242655 -0.225327 -0.225295 0.306714 0.306684 0.247909 0.247928 0.244887 0.244896 0.231950 0.231952 0.230987 0.230977
chargesum: 0.00000
title: Mulliken charges with hydrogens summed into heavy atoms:
elementType: Br Br C C C C C C C C C C C C C C
charge: -0.013382 0.004783 -0.559231 0.419870 0.419660 0.183879 0.183999 -0.053059 -0.140569 -0.140536 -0.147657 -0.147686 -0.010711 -0.010703 0.005660 0.005682
polarizability: 2.30414655e+02 -5.41376401e-02 1.65276032e+02 -4.11306455e-02 -2.79581220e+01 1.71346644e+02
1716.lowfreq: -7.6845 -6.5198 -0.0003 -0.0003 0.0002 6.0786 43.9470 47.1200 87.9919
frequency: 43.8507 47.1150 87.9918 98.6489 103.5647 148.9056 168.1056 204.4120 221.8405 231.9224 303.3253 404.2787 416.1755 437.7754 468.2816 508.7327 548.6323 565.3778 569.5492 581.7183 617.0285 655.7409 714.2341 747.4199 759.1132 763.6087 790.6717 798.7208 802.9884 882.0744 889.4782 939.7063 952.4055 952.7249 989.8091 991.6209 996.8927 1021.0650 1031.1000 1044.6573 1106.1064 1120.7193 1134.1864 1174.4053 1175.3053 1211.9926 1224.9924 1231.1282 1267.7447 1299.9828 1304.8398 1373.9449 1407.6008 1440.6416 1443.0800 1447.6340 1465.4776 1492.0287 1596.4040 1597.6741 1618.1946 1618.9405 3076.9066 3129.0643 3129.9326 3135.8078 3137.1999 3148.6575 3149.8534 3164.5056 3166.9676 3167.6140
redmass: 7.3765 8.8188 5.5762 7.0268 8.3897 3.9343 26.8085 5.4377 2.5616 6.3638 3.8784 4.4698 4.0815 4.5647 3.0629 5.2911 5.9880 3.2430 5.5157 4.5817 6.8492 4.7718 5.2772 1.6200 1.5035 4.1879 2.2145 2.7207 2.9099 1.4166 1.6569 1.8730 1.4261 1.4402 1.3632 1.3377 6.3770 2.5613 1.9492 3.8785 1.8171 1.8493 1.3131 1.0793 1.0726 1.2604 1.8821 2.0860 3.0414 1.5758 1.9178 8.9685 3.2697 2.2347 1.1795 2.4217 2.6200 4.4352 7.2236 6.4855 7.1050 7.3688 1.0563 1.0857 1.0857 1.0897 1.0900 1.0948 1.0948 1.1116 1.1003 1.1003
irintensity: 0.2286 0.1080 2.5393 1.1999 2.2755 0.0730 1.9763 0.9320 0.9527 6.7127 0.2674 0.5417 1.0049 32.1302 0.1207 0.1197 26.9978 0.0115 78.0266 0.0448 4.2214 47.5290 5.1354 142.9782 0.0004 14.4876 0.0465 1.9474 12.6017 4.1267 0.0616 10.3061 1.2745 0.0063 0.0055 0.4899 1.8967 0.4946 3.1550 0.1008 8.6826 4.2875 1.0404 0.2928 0.0188 19.1118 2.3138 6.5227 21.5187 11.2848 0.6354 3.4265 0.3049 38.6492 7.4866 14.9393 1.8680 1.2950 0.4169 2.4407 6.4660 21.1241 5.1387 2.5081 1.9947 4.1063 2.3560 2.1554 39.6187 0.3315 54.3809 7.2195
temp: 298.150 k
press: 1.00000 atm
elementType: 35 35 6 6 6 6 6 6 6 6 6 6 6 6 6 6 1 1 1 1 1 1 1 1 1 1
symmnumber: 1
zpe: 506384.0 jmol-1
zpe.correction: 0.192871 hartree
zpe.thermalcorrener: 0.206548 hartree
zpe.thermalcorrenthalpy: 0.207493 hartree
zpe.thermalcorrgfe: 0.150211 hartree
zpe.sumelectzpe: -565.331359 hartree
zpe.sumelectthermal: -565.317682 hartree
zpe.sumelectthermalent: -565.316738 hartree
zpe.sumelectthermalfe: -565.374020 hartree
dipole: 0.0006 1.4252 -0.7394
dipole: 1.6055
quadrupole: -95.1218 -103.9921 -119.5267
quadrupole: -0.0130 -0.0207 -10.9651
quadrupole: 11.0918 2.2214 -13.3132 -0.0130 -0.0207 -10.9651
hfenergy: -565.5242309 hartree
pointgroup: C01 [X(C14H10Br2)]
dipole: -0.0034814 -0.6306019 -0.0365604 debye
dipolederiv: -0.2115157 0.0016204 0.0038001 -0.0002971 -0.4810336 -0.175085 0.002324 -0.4383371 -0.877531 -0.0945075 -0.0009286 0.0045085 -0.0002275 -0.1420702 -0.0046642 0.0049941 0.0925935 -0.7035326 0.561922 -0.0027368 -0.0017783 -0.0001779 0.734986 0.1538353 0.0000827 0.5004041 0.9345841 -0.3300301 -0.0216411 0.006116 0.0535686 -0.1315832 0.033695 0.0290728 0.0263858 -0.141419 -0.3299307 0.0237297 -0.0083931 -0.0516744 -0.1316051 0.0328092 -0.0313873 0.0266959 -0.1421165 0.244356 0.1243694 0.0378136 -0.0069141 0.0085511 0.0153222 -0.0347116 -0.0316168 0.0093688 0.2431371 -0.1266202 -0.0342532 0.0038772 0.0100262 0.0158684 0.0377146 -0.0335972 0.0094788 -0.0143076 0.0010155 -0.0066393 -0.0001448 -0.0070779 0.0252958 -0.0075293 -0.1470119 0.8902077 0.0692382 -0.0269678 -0.0013036 -0.1231433 0.0915189 -0.0080904 0.015702 0.0399539 -0.0903065 0.071256 0.0264518 0.0034762 0.1234848 0.0896346 -0.0064243 -0.0129144 0.0405763 -0.0904556 -0.2094034 -0.1558711 -0.0508622 -0.0623405 0.0654809 0.008532 0.0015652 0.0249014 -0.1341034 -0.2076441 0.158809 0.0499772 0.0654732 0.0628862 0.0088627 -0.0023345 0.0271375 -0.1334321 0.020698 -0.0091416 0.0114381 -0.0914301 -0.0745018 0.0101135 0.0058028 0.0168731 -0.1516148 0.0220448 0.0076107 -0.0089143 0.0901272 -0.0757311 0.0115397 -0.0031107 0.0170035 -0.1518534 0.0638789 0.1133565 0.0340101 0.1366781 0.022871 0.0008277 0.0139298 0.011121 -0.1365677 0.0616802 -0.1140714 -0.0312418 -0.1371139 0.0258393 -0.0007519 -0.0109644 0.0096979 -0.1371542 0.0107972 -0.0941441 0.0096416 -0.0538203 0.0575708 -0.0179227 -0.0295353 -0.0212696 -0.0542075 0.0121142 0.095058 -0.0088072 0.0545635 0.0559459 -0.0170505 0.0303225 -0.0201709 -0.0538185 0.0871832 0.0247137 -0.0106885 0.0702706 -0.0714898 -0.0085734 -0.0075254 -0.0313862 0.1204491 0.0858049 -0.0260063 0.0101243 -0.0719743 -0.0701874 -0.0096504 0.0066405 -0.0318811 0.1207064 0.0717076 0.0813851 0.0040142 0.0372816 -0.075128 -0.0147721 0.0070364 -0.0124435 0.1503524 0.0704864 -0.0828884 -0.0053233 -0.0387669 -0.0736226 -0.015213 -0.0083226 -0.0135687 0.1501534 -0.1229016 0.0236741 -0.0079839 0.0397566 0.0803323 -0.0042861 -0.0053177 -0.0070187 0.1560438 -0.1237406 -0.021131 0.003925 -0.0372753 0.0810332 -0.0049246 0.0012168 -0.0073655 0.1561854 -0.0272564 -0.1028869 -0.0116787 -0.1193653 -0.025013 -0.0154403 -0.0180733 -0.0194702 0.1501107 -0.0250668 0.1032415 0.0090227 0.1195841 -0.0276327 -0.0138527 0.0153223 -0.0182065 0.1504722 unknown
polarizability: 230.4074107|-0.4044062|187.1352016|0.6943356|20.8920318|149.494719 unknown
InChI: InChI=1S/C14H10Br2/c15-9-14(16)12-7-3-1-5-10(12)11-6-2-4-8-13(11)14/h1-8H,9H2
charge 0 multiplicity 1
26 atoms
Br -0.00767 2.183418 2.189006
Br 0.026849 2.080498 -2.603068
C  0.001526 1.308632 0.240719
C  -1.19732 0.384384 0.144367
C  1.190758 0.370488 0.161505
C  -0.749974 -0.967376 0.058433
C  0.728892 -0.976004 0.069089
C  0.014782 2.567218 -0.619598
C  -2.564663 0.699406 0.121929
C  2.561886 0.669516 0.158757
C  -1.682696 -2.017526 -0.045311
C  1.650628 -2.037005 -0.021342
C  -3.502468 -0.357381 0.014433
C  3.488685 -0.39821 0.06473
C  -3.063654 -1.7021 -0.065198
C  3.035312 -1.737705 -0.021347
H  0.922943 3.167524 -0.471992
H  -0.888919 3.177288 -0.485286
H  -2.908072 1.736647 0.202398
H  2.916116 1.702689 0.244343
H  -1.353338 -3.059748 -0.117382
H  1.31019 -3.075313 -0.098236
H  -4.574578 -0.134766 -0.003917
H  4.56349 -0.188224 0.06187
H  -3.803035 -2.50658 -0.145657
H  3.76633 -2.550771 -0.091245
