program: Gaussian 09
title: 000261776
version: EM64L-G09RevD.01
frameworkgroup: C1[X(C15H9BrCl3NO)]
method: RPBEPBE
basis: SDD
operation: Freq
keyword: #p
keyword: freq=noraman
keyword: PBEPBE/SDD
title: #p freq=noraman PBEPBE/SDD
converged: YES YES NO NO
title: Mulliken charges:
elementType: Br Cl Cl Cl O N C C C C C C C C C C C C C C C H H H H H H H H H
charge: 0.070083 0.011280 0.007757 -0.051853 -0.219032 -0.494758 -0.700219 0.437862 0.419372 0.292561 0.196861 -0.672879 -0.367092 0.842332 -0.399631 -0.360886 -0.537093 -0.106421 -0.227246 0.228099 -0.771007 0.273858 0.268715 0.271409 0.271315 0.258812 0.318921 0.257734 0.262427 0.218720
chargesum: 0.00000
title: Mulliken charges with hydrogens summed into heavy atoms:
elementType: Br Cl Cl Cl O N C C C C C C C C C C C C C C C
charge: 0.070083 0.011280 0.007757 -0.051853 -0.219032 -0.175837 -0.157647 0.437862 0.419372 0.292561 0.196861 -0.672879 -0.367092 0.842332 -0.128222 -0.089571 -0.537093 -0.106421 0.031566 0.228099 -0.032126
polarizability: 3.77594274e+02 -3.55716526e+00 2.40028052e+02 -5.47180010e+00 3.52659965e+00 9.80405835e+01
1716.lowfreq: -2.4364 -0.0012 0.0010 0.0016 2.1036 5.9827 31.5194 46.6219 56.5911
frequency: 31.5073 46.6206 56.5787 65.8598 71.6032 78.4369 84.6191 100.4688 125.4823 160.8852 174.2497 192.6083 210.1512 223.2030 229.6051 265.8024 283.7703 299.1575 314.6684 327.2783 354.4558 388.9788 398.5619 432.7168 484.6808 515.0576 517.4436 528.9598 572.1230 581.2650 597.7746 612.0996 633.2941 666.0333 677.8198 716.2827 727.6601 769.8152 784.5614 830.0031 858.2367 871.5411 874.4260 923.8156 948.9410 963.4937 975.6838 1020.6471 1036.4346 1048.2342 1069.5251 1119.2552 1135.1113 1178.4050 1199.3998 1219.8193 1221.3674 1272.3107 1298.4244 1312.8538 1362.8346 1384.7017 1411.7342 1419.0725 1420.1563 1423.5627 1440.1850 1456.1686 1466.4676 1472.3829 1535.8596 1579.6308 1600.6139 1610.7682 1646.2841 2994.2388 2994.5352 3038.8398 3083.7731 3123.1811 3161.1322 3167.3668 3193.7671 3524.3314
redmass: 8.4791 9.4207 2.9112 1.7067 3.0949 6.2157 4.7073 15.7541 12.5061 23.8446 8.0715 28.5007 16.2274 3.5803 4.7571 5.9850 7.1227 5.4835 16.0154 6.0238 5.4775 6.8186 6.2489 3.1240 4.6683 3.4007 1.7966 2.5260 3.5607 6.4939 5.4902 6.8795 7.6776 6.6317 6.6797 5.6085 6.8046 5.5332 5.6104 1.5084 5.4325 1.4970 5.4675 4.7217 2.0591 1.4364 2.2252 4.6875 1.7545 4.1064 2.0302 2.2228 1.1425 2.2940 2.0507 2.6619 2.4819 1.3923 4.7421 6.4518 8.0983 1.2273 5.5690 1.7171 2.2129 4.3899 1.3564 1.5677 1.5377 1.5002 8.2386 7.9992 10.5597 7.8433 7.0692 1.0615 1.0373 1.0988 1.0986 1.0988 1.0935 1.0904 1.0954 1.0767
irintensity: 0.7154 0.2159 4.4548 0.6771 5.3959 1.9374 0.5449 0.2850 4.6905 0.5423 1.3886 0.2548 0.9827 4.4741 2.7568 2.8643 1.1996 6.3684 1.0388 1.6911 3.2851 9.6672 12.3341 10.7319 4.6043 23.3332 61.2773 30.2910 8.1497 4.7670 4.1826 5.7650 4.5277 29.5864 21.1886 15.2421 25.1083 3.6312 3.7850 38.1690 56.6252 9.9853 7.7608 5.7557 8.5214 2.4650 29.4118 15.9034 25.7118 2.9813 21.5901 9.1119 0.1359 86.2580 23.5292 135.9864 74.7057 5.4627 34.1101 44.2334 1.7725 69.7480 52.5981 1.5559 39.3161 235.8651 155.7138 85.7778 61.1516 28.4149 15.2219 18.7304 21.9531 21.4124 132.5639 2.0973 9.8396 1.8314 13.8934 8.5998 1.4083 1.5862 2.7011 24.5619
temp: 298.150 k
press: 1.00000 atm
elementType: 35 17 17 17 8 7 6 6 6 6 6 6 6 6 6 6 6 6 6 6 6 1 1 1 1 1 1 1 1 1
symmnumber: 1
zpe: 521521.9 jmol-1
zpe.correction: 0.198637 hartree
zpe.thermalcorrener: 0.218409 hartree
zpe.thermalcorrenthalpy: 0.219353 hartree
zpe.thermalcorrgfe: 0.147970 hartree
zpe.sumelectzpe: -2099.175141 hartree
zpe.sumelectthermal: -2099.155370 hartree
zpe.sumelectthermalent: -2099.154426 hartree
zpe.sumelectthermalfe: -2099.225808 hartree
dipole: 2.0335 0.2519 -2.8002
dipole: 3.4698
quadrupole: -140.9883 -148.9823 -157.3122
quadrupole: 1.3611 -9.1699 6.0390
quadrupole: 8.1060 0.1119 -8.2179 1.3611 -9.1699 6.0390
hfenergy: -2099.3737785 hartree
pointgroup: C01 [X(C15H9Br1Cl3N1O1)]
dipole: 0.7363948 0.12254 -1.1429347 debye
polarizability: 375.5773611|11.4931386|240.8342114|-18.160102|-6.2792098|99.2513373 unknown
InChI: InChI=1S/C15H9BrCl3NO/c1-6(21)20-15-12(16)14(19)11-9-3-2-8(17)4-7(9)5-10(11)13(15)18/h2-4,20H,5H2,1H3
charge 0 multiplicity 1
30 atoms
Br 2.93481 2.937452 -0.484564
Cl 1.936801 -2.677268 -0.609189
Cl -0.340855 3.338456 -0.226995
Cl -6.445989 -0.887014 0.427366
O  3.931163 -1.302489 1.430294
N  3.650857 -0.087591 -0.551513
C  -1.134928 -1.807718 -0.124872
C  -0.029969 -0.775598 -0.22389
C  -0.57111 0.546965 -0.160997
C  -2.380033 -0.949777 0.010938
C  -2.038774 0.439591 -0.010496
C  1.341146 -0.981783 -0.38728
C  0.310388 1.645866 -0.265052
C  2.249962 0.110395 -0.436188
C  -3.712846 -1.371326 0.143276
C  -3.05601 1.416728 0.104996
C  1.702643 1.428259 -0.388915
C  -4.704828 -0.37455 0.254634
C  -4.400522 1.002598 0.238929
C  4.427996 -0.788093 0.395095
C  5.905452 -0.888155 0.033275
H  -0.983827 -2.477102 0.743746
H  -1.164905 -2.461087 -1.017931
H  -3.981703 -2.43141 0.160925
H  -2.821124 2.48244 0.093952
H  -5.201666 1.741282 0.330287
H  4.146465 0.466256 -1.254221
H  6.088793 -1.849337 -0.480995
H  6.499932 -0.882899 0.959737
H  6.250384 -0.07259 -0.626755
