program: Gaussian 09
title: 000261747
version: EM64L-G09RevD.01
frameworkgroup: C1[X(C7H14N2O)]
method: RPBEPBE
basis: SDD
operation: Freq
keyword: #p
keyword: freq=noraman
keyword: PBEPBE/SDD
title: #p freq=noraman PBEPBE/SDD
converged: YES YES NO NO
title: Mulliken charges:
elementType: O N N C C C C C C C H H H H H H H H H H H H H H
charge: -0.297739 -0.095682 -0.133222 -0.410981 -0.426089 -0.412404 -0.521551 0.269173 -0.631055 -0.615779 0.217171 0.237688 0.236118 0.214694 0.196253 0.251364 0.248835 0.231042 0.228402 0.260992 0.230098 0.283378 0.219498 0.219795
chargesum: 0.00000
title: Mulliken charges with hydrogens summed into heavy atoms:
elementType: O N N C C C C C C C
charge: -0.297739 -0.095682 -0.133222 0.043878 0.024724 0.035213 -0.041674 0.269173 0.088437 0.106892
polarizability: 1.18302564e+02 6.39690961e+00 9.01001443e+01 5.46854671e-01 1.74960515e+00 6.90162926e+01
1716.lowfreq: -5.2547 -1.7409 -0.0006 -0.0005 -0.0004 15.9847 41.6262 52.7114 78.1912
frequency: 41.3755 52.7079 78.1851 98.9845 111.0224 134.7159 174.2344 244.3329 251.2778 262.2465 363.5118 374.1213 417.9313 495.9292 554.6985 590.2241 703.3753 783.4281 792.6849 827.9745 839.8765 952.2101 974.2217 989.0613 1049.7115 1050.8456 1060.6879 1077.7565 1082.1112 1091.7027 1117.7168 1135.9630 1144.1370 1148.1667 1194.0870 1240.5484 1258.6685 1278.1207 1292.1261 1361.7403 1392.7597 1407.0505 1439.7659 1450.3445 1455.5391 1465.5545 1472.4964 1475.2746 1476.9331 1488.2335 1506.5082 1584.6846 2922.3915 2957.0221 2965.4943 2981.0006 3021.1429 3034.2972 3037.3583 3048.7578 3060.3237 3067.9360 3116.5569 3132.3284 3160.6697 3178.4558
redmass: 2.2507 2.8142 1.4384 3.0830 3.0737 1.1142 2.1055 2.4795 3.0552 4.1480 3.5620 2.2656 2.8077 3.5577 2.7197 4.7165 3.6999 4.1550 1.3746 1.3614 3.5198 2.6170 1.2236 2.0355 1.7471 1.3872 1.3100 1.5014 2.1172 1.2221 1.6170 1.5060 1.3981 1.8919 1.3119 6.0807 3.3795 1.4451 1.2015 1.5273 2.4294 1.2115 1.1422 1.0943 1.1058 1.1117 1.0447 1.1093 1.1223 1.0462 1.2172 6.3165 1.0699 1.0386 1.0366 1.0603 1.1010 1.0966 1.1016 1.0515 1.0615 1.0940 1.0968 1.0932 1.1141 1.1152
irintensity: 4.1177 1.9724 0.2891 1.9322 4.5284 0.2362 2.7710 7.5166 0.4607 1.0103 18.3853 3.1159 1.8658 5.3024 1.4777 9.0474 9.6492 1.4147 5.3495 3.8069 5.4780 2.6844 11.5942 54.6556 5.9264 6.4182 2.8874 25.6856 7.7446 0.0581 18.4868 48.3959 0.8685 60.6007 1.7227 24.5857 13.2040 20.6926 0.7939 9.3911 103.1954 57.9342 8.7346 2.8570 17.3909 3.3696 2.7577 18.2163 1.2459 29.4396 22.3428 262.4612 47.5056 45.5801 109.2398 18.8153 42.9213 5.6038 38.2013 30.6886 37.1138 29.1693 1.7465 14.9687 2.4735 45.1766
temp: 298.150 k
press: 1.00000 atm
elementType: 8 7 7 6 6 6 6 6 6 6 1 1 1 1 1 1 1 1 1 1 1 1 1 1
symmnumber: 1
zpe: 538267.5 jmol-1
zpe.correction: 0.205015 hartree
zpe.thermalcorrener: 0.216971 hartree
zpe.thermalcorrenthalpy: 0.217915 hartree
zpe.thermalcorrgfe: 0.166045 hartree
zpe.sumelectzpe: -459.004637 hartree
zpe.sumelectthermal: -458.992681 hartree
zpe.sumelectthermalent: -458.991737 hartree
zpe.sumelectthermalfe: -459.043607 hartree
dipole: 1.2093 3.0788 0.9674
dipole: 3.4463
quadrupole: -50.9570 -65.0947 -62.3867
quadrupole: 6.9400 -3.1180 1.4516
quadrupole: 8.5225 -5.6152 -2.9072 6.9400 -3.1180 1.4516
hfenergy: -459.2096519 hartree
pointgroup: C01 [X(C7H14N2O1)]
dipole: 0.4740535 1.1534841 0.5321537 debye
dipolederiv: -0.7497179 -0.009911 -0.008532 -0.356229 -1.0986129 -0.048163 -0.0299703 -0.0240632 -0.3468291 -0.725526 0.0914648 0.1892323 0.104864 -0.1993671 0.1261601 0.2394627 0.1195901 -0.3013421 -1.1263587 -0.3863499 -0.0429846 -0.2231184 -0.6694806 -0.0242911 -0.0633915 -0.0401388 -0.3354689 0.1372479 -0.0519594 0.0310006 -0.0766174 0.0802202 -0.0970342 -0.0013246 -0.112113 0.1196629 0.1052919 -0.0865187 -0.044081 -0.0860918 0.1545182 -0.0944946 -0.0594012 -0.0896157 0.0458144 0.5861565 -0.1139182 -0.0564677 -0.1336549 0.1936656 -0.0221431 -0.0195942 -0.0584812 0.2395903 -0.3175171 0.0672712 -0.0003728 0.2312979 -0.0702771 -0.0179766 -0.0545416 0.0174143 0.1573489 1.5044567 0.4248829 0.0808845 0.501471 1.2017577 0.0730842 0.102248 0.0626668 0.1322022 0.0685869 0.1050915 -0.0125752 0.2152206 0.4522404 0.012921 -0.008253 0.0126415 0.2794932 0.3815172 -0.0665062 0.0056117 -0.2631234 -0.0191025 -0.0210155 0.0018502 -0.0140793 0.2732306 0.0274035 0.0199453 -0.0362093 -0.0655636 -0.1325181 0.0628928 0.0205402 0.0827973 0.0800722 -0.1138514 -0.0048455 -0.0940658 0.0058883 0.0552565 0.0304973 -0.1258777 0.0140061 0.0470596 0.068667 0.0696118 0.0036054 0.1128948 -0.0964043 -0.0691887 0.0206382 -0.0353597 0.0387777 0.0615125 0.0642943 -0.090944 0.050975 0.0321788 0.0786249 -0.043192 0.0106485 -0.1203682 -0.0357128 -0.0066833 0.0444713 0.0346694 -0.0621052 0.0982449 -0.044613 0.1600236 -0.0890073 0.0212789 0.014138 0.0155297 0.0251962 0.0089888 -0.0901382 0.0247638 -0.0915179 -0.0501744 0.0624485 -0.0034024 0.0178865 -0.027314 -0.0032007 0.0857283 0.0443442 0.1009208 -0.0154206 0.0488864 0.0189189 -0.009593 -0.0017981 -0.0019727 -0.0866054 -0.0090373 -0.1129356 -0.0499224 0.0233096 -0.0966597 -0.0982861 -0.0620092 -0.0149512 -0.0226664 -0.12506 -0.114118 -0.1010005 -0.0407584 0.1258512 -0.0082528 0.0909922 0.0453021 0.0014534 -0.0074609 0.0060754 0.1077126 -0.0087524 -0.1173533 0.1093655 -0.0709467 -0.020061 0.0181835 0.1341925 0.1020982 -0.0637258 0.1927748 -0.0619734 -0.0004833 0.0635107 -0.0226942 -0.0007511 0.0060532 -0.008985 0.1292354 -0.0695326 0.0084622 -0.0749112 -0.023972 0.0973422 -0.0845795 -0.15123 -0.0411321 -0.108766 -0.1018109 -0.0038509 0.0801712 -0.0465417 0.0892769 0.091257 0.1488543 0.0536567 -0.0681746 unknown
polarizability: 118.1973687|6.6700254|89.3805462|0.3846675|4.4040216|69.8410859 unknown
InChI: InChI=1S/C7H14N2O/c1-8(2)7(10)3-4-9-5-6-9/h3-6H2,1-2H3
charge 0 multiplicity 1
24 atoms
O  1.202044 -1.722025 -0.16887
N  -2.530954 0.306112 -0.441279
N  2.413705 0.258288 -0.022005
C  -3.831349 -0.362649 -0.079415
C  -3.207213 0.655649 0.864188
C  -1.314489 -0.54834 -0.326023
C  -0.084087 0.364504 -0.19667
C  1.216012 -0.448625 -0.129545
C  2.532579 1.721596 0.018243
C  3.682081 -0.487105 0.044906
H  -3.802617 -1.415998 0.233576
H  -4.691446 -0.086812 -0.697286
H  -3.614701 1.669388 0.929869
H  -2.767518 0.267643 1.794682
H  -1.352994 -1.257119 0.533277
H  -1.232966 -1.155656 -1.243866
H  -0.069571 1.052545 -1.063987
H  -0.187918 0.998756 0.706511
H  3.023749 2.046755 0.957115
H  1.54798 2.205448 -0.039623
H  3.146122 2.085841 -0.829966
H  3.45101 -1.561795 -0.006861
H  4.213445 -0.270179 0.992032
H  4.341895 -0.211622 -0.800702
