program: Gaussian 09
title: 000262039
version: EM64L-G09RevD.01
frameworkgroup: C1[X(C24H20N6O6S2)]
method: RPBEPBE
basis: SDD
operation: Freq
keyword: #p
keyword: freq=noraman
keyword: PBEPBE/SDD
title: #p freq=noraman PBEPBE/SDD
converged: NO YES NO NO
title: Mulliken charges:
elementType: S S O O O O O O N N N N N N C C C C C C C C C C C C C C C C C C C C C C C C H H H H H H H H H H H H H H H H H H H H
charge: 0.031879 0.046215 -0.402769 -0.423937 -0.227045 -0.214314 -0.263166 -0.280064 -0.371933 -0.369255 -0.058664 -0.022008 -0.006462 -0.130109 -0.112558 -0.104457 -0.679029 -0.714648 0.167808 0.181779 0.161870 0.161931 0.095400 0.062104 0.051696 0.074097 0.059176 0.180809 -0.387582 -0.368390 -0.352565 -0.327932 -0.314353 -0.320813 -0.223220 -0.210917 -0.210274 -0.211485 0.299134 0.289878 0.301225 0.296852 0.302261 0.325263 0.360210 0.387352 0.284819 0.305741 0.327073 0.266274 0.264363 0.261824 0.238511 0.241589 0.237083 0.241411 0.405792 0.396530
chargesum: 0.00000
title: Mulliken charges with hydrogens summed into heavy atoms:
elementType: S S O O O O O O N N N N N N C C C C C C C C C C C C C C C C C C C C C C C C
charge: 0.031879 0.046215 0.003023 -0.027408 -0.227045 -0.214314 -0.263166 -0.280064 -0.011723 0.018097 -0.058664 -0.022008 -0.006462 -0.130109 0.186576 0.185421 -0.080952 -0.087124 0.167808 0.181779 0.161870 0.161931 0.095400 0.062104 0.051696 0.074097 0.059176 0.180809 -0.102764 -0.062649 -0.025492 -0.061657 -0.049990 -0.058988 0.015291 0.030672 0.026809 0.029926
polarizability: 4.76675436e+02 -4.04940364e+01 3.55228803e+02 3.15909967e+01 -3.48545269e+01 2.77647196e+02
1716.lowfreq: -9.9912 -6.1082 -5.4144 -0.0019 -0.0012 0.0008 7.4409 20.1295 25.8530
frequency: 6.6677 20.1143 25.8428 26.7310 34.3878 35.0579 48.2548 53.6382 59.2646 60.4550 66.8114 72.4072 83.1882 91.2336 95.0532 108.6446 121.4781 133.8982 144.9574 170.9007 175.0949 178.2070 189.6823 209.3229 213.4152 227.1224 234.1607 258.9543 269.4322 292.7214 296.1932 321.9015 338.5252 349.2727 355.8757 393.3226 408.6436 414.0305 425.0679 434.6093 477.2575 481.7683 484.7145 486.6667 493.7614 496.8652 519.6967 523.6800 524.2055 547.2342 559.2883 567.8198 587.7032 589.7255 597.3656 606.3487 612.1516 615.0972 629.9408 635.7725 647.7115 690.6112 712.5381 717.5178 735.6357 740.6200 745.4239 747.5173 750.9812 770.0285 778.0017 782.5793 783.7685 800.2338 815.2709 817.1544 832.7677 836.8870 879.2919 880.7294 889.0861 903.0635 910.0807 924.3920 946.0557 949.3913 962.0000 964.7782 969.8387 977.6456 988.7619 999.8677 1003.8085 1012.1787 1012.5395 1016.4462 1067.1358 1080.9660 1098.5352 1112.4430 1116.3093 1140.3690 1148.5068 1154.0024 1165.8060 1168.1428 1184.3630 1194.7744 1198.8713 1202.4788 1223.0047 1239.3693 1244.5236 1245.0083 1265.2995 1269.5132 1276.2911 1279.4799 1289.9031 1292.9853 1312.2057 1314.1458 1326.1306 1328.8441 1339.9268 1365.9422 1375.6282 1376.6529 1407.2245 1411.9803 1414.3186 1417.3064 1454.8216 1456.9293 1478.8127 1483.0567 1492.0744 1492.9700 1514.9729 1518.3391 1549.5280 1553.5404 1588.4636 1606.2020 1614.8445 1616.3972 1618.3754 1672.9393 2961.7316 2989.6815 3030.4386 3053.4922 3107.3041 3115.0934 3136.1206 3138.2652 3142.2821 3149.7297 3155.0842 3161.8160 3164.3392 3169.0129 3169.8067 3173.7350 3178.4935 3460.5089 3504.1329 3527.6307
redmass: 7.6782 7.0776 7.1679 9.3840 7.5992 8.2440 7.3579 6.8863 8.7129 9.0021 9.2776 8.3982 7.8835 7.8475 7.9072 7.3136 9.6512 7.4633 9.4584 9.3715 6.1830 4.5993 4.7776 6.6087 6.8077 5.3848 5.9742 5.4123 3.9874 7.5834 5.8260 3.9654 8.2751 6.4357 5.1520 6.4552 4.8886 4.7535 5.2233 5.1329 3.7297 4.4037 4.1733 4.9560 4.3857 4.0784 4.1033 6.8182 7.0770 4.8871 4.3856 5.6745 6.2494 6.6694 3.5573 7.9127 7.3757 8.4673 2.6250 4.3906 2.3653 1.2802 4.0348 3.3962 1.4395 3.5645 6.0568 5.8120 3.0172 5.1804 1.6273 3.7627 1.5288 2.6017 3.4280 1.4360 2.7699 2.2995 4.6881 4.3512 1.6967 1.5610 3.9239 3.9913 1.4601 1.5644 3.1167 5.7709 3.7786 1.4145 1.3532 2.6072 1.3449 2.1704 2.1239 1.3087 2.0546 2.9060 3.0384 1.8619 1.8223 2.4299 1.4743 1.5026 1.2482 1.3037 1.6122 1.8141 1.8309 2.0210 1.2887 1.3603 1.9602 2.0453 1.8621 2.4420 2.6053 2.3177 1.4547 1.5617 1.5000 1.4299 2.5406 2.3608 2.3533 1.8247 2.6012 2.6840 1.0968 1.0928 4.7566 4.5034 2.6801 2.6897 3.1157 3.4036 2.5890 3.0366 7.4223 6.8439 6.9747 6.9529 9.8141 8.7404 8.0841 6.5102 6.5080 9.4581 1.0800 1.0811 1.0589 1.0576 1.0674 1.1060 1.0866 1.1083 1.0865 1.0903 1.0897 1.0970 1.0931 1.0956 1.0940 1.0997 1.1007 1.0780 1.0780 1.0644
irintensity: 0.2194 1.3931 0.5002 3.4863 0.6950 0.2970 0.9845 0.3092 1.9193 1.5547 1.0367 3.2247 1.7390 0.4606 2.8074 5.4908 1.4095 6.3702 5.1824 1.7780 3.4148 3.6759 1.6645 6.0255 8.5958 4.7162 1.4798 4.1260 6.1482 4.1295 3.8934 2.1763 10.7866 2.9113 14.7689 3.4313 31.4555 9.8285 10.4804 7.8966 5.4953 1.5423 3.7931 5.3327 2.7673 0.6062 55.9561 3.5020 1.8837 26.6992 6.6099 15.4390 17.2675 3.9160 32.1338 1.5130 1.3045 0.6688 38.2444 0.1227 42.2903 105.6969 23.8075 46.1489 42.9891 17.0649 1.9921 4.5358 6.9054 8.7528 84.1903 13.8415 94.7379 78.7461 16.8103 184.4466 41.4786 34.8159 29.6885 15.8172 0.0929 0.7289 12.3885 11.8518 10.2445 11.2929 19.3012 8.5817 42.7931 6.7618 5.0120 24.3344 0.0304 13.2558 5.3102 2.6686 73.3278 17.1330 100.3089 4.7026 3.3398 170.1110 8.2003 18.0711 4.6626 4.6881 24.6440 4.1184 5.7676 43.7638 1.6089 26.7632 1.7819 3.6111 1.6519 2.5806 1.1908 0.7226 12.7500 5.4179 48.9513 12.9572 13.9118 1.2075 6.6094 50.1260 31.4139 24.4931 22.6443 25.3433 27.7136 15.5503 0.3552 15.6809 143.6665 178.2194 271.9319 217.3170 2.0839 7.9150 21.8038 20.1170 160.3725 194.4126 249.1945 16.7204 2.0748 221.9904 40.4647 14.1797 1.1617 7.2838 476.7484 2.1323 18.9689 2.7622 2.1823 20.6640 5.3941 16.2994 0.3043 7.6741 3.8307 37.2570 20.2651 48.8665 63.5417 45.3948
temp: 298.150 k
press: 1.00000 atm
elementType: 16 16 8 8 8 8 8 8 7 7 7 7 7 7 6 6 6 6 6 6 6 6 6 6 6 6 6 6 6 6 6 6 6 6 6 6 6 6 1 1 1 1 1 1 1 1 1 1 1 1 1 1 1 1 1 1 1 1
symmnumber: 1
zpe: 1092347.0 jmol-1
zpe.correction: 0.416053 hartree
zpe.thermalcorrener: 0.450219 hartree
zpe.thermalcorrenthalpy: 0.451163 hartree
zpe.thermalcorrgfe: 0.345281 hartree
zpe.sumelectzpe: -2499.890102 hartree
zpe.sumelectthermal: -2499.855936 hartree
zpe.sumelectthermalent: -2499.854992 hartree
zpe.sumelectthermalfe: -2499.960874 hartree
dipole: 5.1595 2.8906 -3.8359
dipole: 7.0492
quadrupole: -200.9901 -236.0436 -236.4446
quadrupole: -10.1977 7.5885 1.3219
quadrupole: 23.5026 -11.5508 -11.9518 -10.1977 7.5885 1.3219
hfenergy: -2500.3061547 hartree
pointgroup: C01 [X(C24H20N6O6S2)]
dipole: 0.7320354 2.6550153 -0.3263499 debye
polarizability: 317.9537085|56.1053944|323.3922454|-50.7362456|-30.5179454|468.2054814 unknown
InChI: InChI=1S/C24H20N6O6S2/c31-21(17-9-25-13-5-1-3-7-15(13)27-17)29-19(23(33)34)11-37-38-12-20(24(35)36)30-22(32)18-10-26-14-6-2-4-8-16(14)28-18/h1-10,19-20,29-30,33,35H,11-12H2
charge 0 multiplicity 1
58 atoms
S  2.376081 -0.815934 -1.258445
S  3.199184 -1.411152 0.795624
O  -1.535268 -0.6673 -2.883071
O  4.323268 2.078392 1.79823
O  0.624789 -0.562047 -3.724498
O  4.143137 0.738836 3.69115
O  -1.468231 -4.486251 -0.992457
O  -0.432963 1.410792 1.316205
N  -0.661572 -2.290398 -0.839249
N  1.858202 1.692534 0.985664
N  -1.894874 -1.891844 1.487134
N  1.359471 2.896335 -1.453673
N  -3.551782 -3.901474 2.698609
N  -1.035805 2.070616 -2.804996
C  0.076176 -2.326385 -2.092709
C  2.210885 0.940475 2.189648
C  1.604918 -2.442618 -1.895706
C  2.005369 -0.59534 2.016523
C  -0.234209 -1.110495 -2.98932
C  3.635283 1.223438 2.660692
C  -1.384521 -3.371557 -0.385667
C  0.548759 1.795449 0.597756
C  -2.082002 -3.105283 0.925986
C  0.345316 2.279472 -0.813873
C  -2.545775 -1.633009 2.680856
C  1.169376 3.187098 -2.795004
C  -3.380907 -2.652691 3.293059
C  -0.027839 2.743408 -3.490891
C  -2.910829 -4.110453 1.532623
C  -0.868611 1.902324 -1.478759
C  -2.3952 -0.355092 3.304553
C  2.186774 3.881091 -3.51886
C  -4.039052 -2.365401 4.526882
C  -0.160418 2.985513 -4.889163
C  -3.055926 -0.106464 4.510623
C  2.0237 4.120584 -4.885101
C  -3.87576 -1.111334 5.123303
C  0.848838 3.669678 -5.571807
H  -0.26616 -3.245055 -2.618386
H  1.527582 1.245654 3.008842
H  1.840614 -3.231003 -1.165421
H  2.108682 -2.642015 -2.854032
H  2.226125 -1.100848 2.973694
H  0.965655 -0.806171 1.722221
H  -0.700876 -1.443361 -0.25877
H  2.591864 2.051806 0.365024
H  -3.030061 -5.079482 1.039799
H  -1.654033 1.392607 -0.914385
H  -1.770158 0.392655 2.805168
H  3.080358 4.201505 -2.975077
H  -4.662133 -3.146721 4.972501
H  -1.063072 2.631609 -5.396077
H  -2.952477 0.869633 4.996923
H  2.801934 4.650311 -5.444313
H  -4.380938 -0.887526 6.069217
H  0.747852 3.861947 -6.645064
H  -1.623891 0.272324 -3.26414
H  5.256352 2.206821 2.118606
