program: Gaussian 09
title: 000261752
version: EM64L-G09RevD.01
frameworkgroup: C1[X(C17H16Cl2N2O)]
method: RPBEPBE
basis: SDD
operation: Freq
keyword: #p
keyword: freq=noraman
keyword: PBEPBE/SDD
title: #p freq=noraman PBEPBE/SDD
converged: YES YES NO NO
title: Mulliken charges:
elementType: Cl Cl O N N C C C C C C C C C C C C C C C C C H H H H H H H H H H H H H H H H
charge: -0.044809 -0.027124 -0.223987 -0.161662 -0.471509 -0.699858 0.323854 0.407447 0.165861 0.271340 -0.603033 -0.619612 -0.389819 0.433212 -0.486594 0.729227 -0.374572 -0.306224 -0.645161 -0.646378 0.220297 -0.773253 0.255673 0.260087 0.253344 0.236047 0.266312 0.238889 0.307544 0.217975 0.234677 0.235428 0.219739 0.235667 0.234582 0.255703 0.257305 0.213387
chargesum: 0.00000
title: Mulliken charges with hydrogens summed into heavy atoms:
elementType: Cl Cl O N N C C C C C C C C C C C C C C C C C
charge: -0.044809 -0.027124 -0.223987 -0.161662 -0.163965 -0.184098 0.323854 0.407447 0.165861 0.271340 -0.349689 -0.619612 -0.153772 0.433212 -0.220283 0.729227 -0.135683 -0.306224 0.042918 0.043609 0.220297 -0.046858
polarizability: 4.39063245e+02 -1.48569057e+00 2.23822358e+02 -5.81542937e+00 -3.32738176e+00 1.14944818e+02
1716.lowfreq: -6.2986 -2.5191 0.0011 0.0016 0.0025 8.0258 28.6863 46.1081 51.3573
frequency: 28.6325 46.0609 51.3305 58.8067 67.2464 71.0123 93.8087 99.0828 105.5749 127.2793 145.0049 171.7063 184.1493 199.7321 213.2821 232.7717 242.7126 275.2701 280.3961 309.7965 317.3364 326.6590 383.1723 393.8594 434.3969 437.2493 447.9245 505.4836 523.2207 526.1260 540.5366 551.6924 568.8956 579.6922 604.0545 641.8557 678.2538 691.4100 709.4647 735.1002 748.7164 779.5559 800.9625 808.4432 846.2898 869.0298 877.3850 909.8092 940.9743 950.0027 957.4973 972.7052 1007.8750 1036.2877 1038.4407 1054.8862 1107.5074 1110.1890 1121.2606 1133.0769 1147.0775 1175.6800 1193.9194 1207.8929 1218.5623 1242.0387 1259.8698 1282.1632 1311.2193 1347.1645 1367.0990 1376.0283 1382.7367 1412.2339 1428.3415 1429.6951 1445.0187 1446.4357 1455.2607 1461.9643 1463.6155 1468.6311 1473.8199 1475.4683 1493.3162 1499.1812 1515.8654 1561.2185 1583.0490 1614.5686 1637.5253 1644.8140 2937.9333 2946.2137 2989.9514 2993.1424 3003.3001 3007.4450 3034.0289 3083.6040 3094.7594 3105.8054 3119.0411 3130.1908 3156.3182 3167.0546 3171.7741 3527.8305
redmass: 4.6159 2.6103 1.9850 4.4925 3.4151 2.0508 3.5572 6.6825 2.7150 3.0769 3.1868 17.0031 1.4410 4.3821 1.8440 4.2968 2.9807 4.1651 3.1059 5.5128 5.6783 6.1325 4.4975 5.8891 3.2382 3.5201 3.3365 2.5790 1.8777 4.6106 3.5214 3.7596 3.9694 3.3501 5.2933 4.2088 6.0179 6.5745 4.2295 6.6486 3.4454 5.9042 6.8058 1.5258 1.5279 4.3896 1.5584 4.4162 1.5704 1.9025 2.8003 2.5349 2.1712 1.9860 3.7270 1.5076 1.2392 1.3219 2.7995 1.1375 1.4911 2.4468 1.6951 2.7523 1.5790 2.2423 3.0097 1.9965 2.7927 3.4325 4.8603 4.7410 1.2294 2.5254 1.4341 1.2006 1.3404 1.9356 1.7099 2.3513 1.0409 1.1221 1.9505 1.0502 1.2542 1.4529 1.6563 7.8722 6.8188 9.7507 7.0126 7.0642 1.0369 1.0394 1.0610 1.0370 1.0999 1.1023 1.0992 1.0988 1.0962 1.0940 1.0988 1.0896 1.0905 1.0928 1.0932 1.0766
irintensity: 1.2814 1.6760 0.6331 0.8311 5.3685 4.3483 0.5640 0.2862 3.5507 4.4350 4.1126 0.4906 1.3282 0.1762 2.4051 0.7656 0.9830 1.7836 8.6953 3.2165 0.9030 1.3955 7.9790 2.3443 1.8601 8.0776 8.4046 34.0018 50.3224 3.0813 6.0688 4.7407 3.5658 11.2544 0.1780 6.9155 6.2069 41.3114 0.2442 28.2468 1.2576 12.4546 24.0642 44.8482 29.0321 4.1380 14.1150 11.6898 1.9117 8.3799 18.2981 14.0674 20.4549 57.8713 23.6058 23.3962 0.0437 1.0168 14.3182 0.1511 0.9053 21.4882 11.8547 75.1007 2.1881 134.3326 27.3101 37.8673 31.7677 226.5380 33.4081 10.5704 57.9884 49.7762 10.2905 28.5659 60.1051 175.8108 2.6745 159.3413 0.1203 47.3152 199.6920 19.3707 1.7999 6.6726 260.1617 54.0279 19.5074 215.8802 344.9641 134.4247 101.6168 151.0368 8.4915 13.3767 17.8634 71.0942 4.8834 15.4486 4.0334 50.7782 10.7110 9.0442 14.3541 1.0104 22.5075 19.5049
temp: 298.150 k
press: 1.00000 atm
elementType: 17 17 8 7 7 6 6 6 6 6 6 6 6 6 6 6 6 6 6 6 6 6 1 1 1 1 1 1 1 1 1 1 1 1 1 1 1 1
symmnumber: 1
zpe: 760590.5 jmol-1
zpe.correction: 0.289694 hartree
zpe.thermalcorrener: 0.311231 hartree
zpe.thermalcorrenthalpy: 0.312175 hartree
zpe.thermalcorrgfe: 0.237812 hartree
zpe.sumelectzpe: -1760.709014 hartree
zpe.sumelectthermal: -1760.687477 hartree
zpe.sumelectthermalent: -1760.686532 hartree
zpe.sumelectthermalfe: -1760.760896 hartree
dipole: -6.2344 2.3597 -2.6611
dipole: 7.1776
quadrupole: -98.4551 -136.1004 -151.4725
quadrupole: 9.3118 -14.8554 0.6864
quadrupole: 30.2209 -7.4244 -22.7965 9.3118 -14.8554 0.6864
hfenergy: -1760.9987078 hartree
pointgroup: C01 [X(C17H16Cl2N2O1)]
dipole: 2.4396776 1.0798658 0.9252476 debye
polarizability: 438.4583707|7.4394862|223.9480076|-12.0344312|-5.3841606|115.4240421 unknown
InChI: InChI=1S/C17H16Cl2N2O/c1-9(22)20-17-15(18)8-13-12-5-4-11(21(2)3)6-10(12)7-14(13)16(17)19/h4-6,8,20H,7H2,1-3H3
charge 0 multiplicity 1
38 atoms
Cl -2.429806 2.820769 0.18638
Cl -3.547737 -2.626113 0.81799
O  -4.90099 -0.772496 -1.454936
N  5.552517 0.234569 -0.20143
N  -4.238057 0.381156 0.472221
C  0.687188 1.732676 0.065391
C  1.865024 0.761757 0.04317
C  -0.506019 0.802395 0.212634
C  1.393432 -0.580333 0.166125
C  -0.07089 -0.560318 0.270771
C  3.228631 1.049859 -0.077823
C  -1.869953 1.080303 0.276509
C  2.322657 -1.643715 0.167982
C  4.183218 -0.023176 -0.078809
C  -1.007046 -1.606057 0.420025
C  -2.853974 0.057321 0.410562
C  3.696975 -1.369577 0.047961
C  -2.373038 -1.277302 0.507447
C  6.515939 -0.87346 -0.201694
C  6.031802 1.615477 -0.335849
C  -5.192296 -0.047289 -0.467308
C  -6.615405 0.413174 -0.162276
H  0.749689 2.452862 0.904046
H  0.621694 2.336072 -0.860586
H  3.55969 2.087991 -0.17136
H  1.988597 -2.683581 0.259558
H  -0.694555 -2.651273 0.488157
H  4.401397 -2.205284 0.050803
H  -4.517442 1.110793 1.131877
H  7.535439 -0.471606 -0.310639
H  6.479135 -1.453168 0.743217
H  6.336553 -1.576177 -1.040834
H  7.129428 1.616061 -0.425175
H  5.617402 2.109783 -1.238395
H  5.762729 2.233738 0.545137
H  -7.159019 -0.406253 0.342336
H  -7.132511 0.624769 -1.111203
H  -6.6591 1.307353 0.484618
