program: Gaussian 09
title: 000261795
version: EM64L-G09RevD.01
frameworkgroup: C1[X(C12H24N2O10S2)]
method: RPBEPBE
basis: SDD
operation: Freq
keyword: #p
keyword: freq=noraman
keyword: PBEPBE/SDD
title: #p freq=noraman PBEPBE/SDD
converged: YES YES NO NO
title: Mulliken charges:
elementType: S S O O O O O O O O O O N N C C C C C C C C C C C C H H H H H H H H H H H H H H H H H H H H H H H H
charge: 1.054221 1.049769 -0.430537 -0.430960 -0.526533 -0.503538 -0.504950 -0.517633 -0.292817 -0.294082 -0.340351 -0.340202 -0.348704 -0.345818 -0.078036 -0.077396 -0.426618 -0.425958 -0.754406 -0.756990 0.337140 0.330467 -0.250974 -0.256921 -0.664225 -0.674843 0.297274 0.298478 0.254107 0.264419 0.263868 0.255327 0.339400 0.339794 0.364305 0.277496 0.281050 0.280927 0.277593 0.364442 0.232861 0.224064 0.232944 0.220584 0.248638 0.227840 0.215095 0.276849 0.224290 0.209249
chargesum: 0.00000
title: Mulliken charges with hydrogens summed into heavy atoms:
elementType: S S O O O O O O O O O O N N C C C C C C C C C C C C
charge: 1.054221 1.049769 -0.430537 -0.430960 -0.526533 -0.503538 -0.504950 -0.517633 -0.292817 -0.294082 -0.340351 -0.340202 -0.009304 -0.006024 0.219239 0.221082 0.091908 0.093238 0.168445 0.165972 0.337140 0.330467 0.205950 0.196607 0.027348 0.035546
polarizability: 2.96335855e+02 2.51352276e+01 2.49921241e+02 -5.99066416e+00 1.39438358e+01 1.83927196e+02
1716.lowfreq: -7.8737 -3.9197 0.0010 0.0012 0.0021 3.2522 14.2972 18.8237 26.2073
frequency: 13.7722 18.3611 26.1383 33.8303 39.4311 43.0116 52.0347 64.2301 71.5749 82.7402 85.9932 89.6967 96.7633 113.4239 114.1756 121.4267 124.2957 138.9969 152.6731 168.8870 171.3885 198.3803 209.4437 217.8633 225.6651 228.0577 231.5041 243.7273 245.2620 260.6782 264.5678 288.7548 310.0418 312.3676 326.9041 332.9646 340.9880 345.0252 359.1633 376.2456 386.3653 389.3389 437.7959 478.5466 490.1710 507.0982 542.2032 582.7999 585.6040 611.2999 626.2729 627.6151 636.0842 664.8110 689.3481 703.5402 713.7334 793.1187 798.7040 818.8169 822.1196 831.6174 833.4081 842.4425 866.6811 872.1239 902.9784 925.8519 926.9262 962.3108 987.0838 1004.8093 1005.6798 1025.3069 1029.1229 1051.8164 1052.9051 1069.5598 1071.3429 1095.8184 1097.3665 1114.9884 1138.3919 1157.3667 1159.7152 1160.3561 1213.8463 1215.9298 1228.1125 1256.0546 1275.0345 1279.7955 1281.7070 1313.3167 1326.1554 1330.8161 1334.0187 1336.4831 1355.5203 1358.5009 1372.1255 1377.2995 1389.6225 1399.7429 1415.0041 1416.3998 1441.5580 1442.2386 1451.3718 1453.1120 1459.1959 1461.4397 1462.9121 1466.6032 1485.3711 1490.8308 1503.0776 1504.2978 1645.0069 1645.8630 2983.2160 2984.8243 2985.7026 2985.8393 2991.7198 2994.5460 3008.8584 3010.4178 3029.2659 3030.5455 3082.5798 3086.0080 3086.8203 3092.7183 3098.5364 3099.0634 3112.9977 3119.1142 3139.8702 3141.0118 3181.6483 3182.0236 3561.3700 3563.5650
redmass: 7.9881 5.4694 6.5567 6.5040 4.5122 4.3606 3.3775 4.4049 3.9076 4.7471 3.7577 5.1450 5.7118 9.0912 8.7200 7.2564 7.6543 7.3595 3.7717 4.0864 5.4521 2.8227 1.6300 2.7565 1.3179 2.3318 1.3324 1.7522 2.2734 2.3093 3.1044 6.1728 4.0403 4.2784 7.6481 3.4802 3.9323 7.9238 10.7543 3.6013 4.1189 3.4565 4.6813 3.2437 3.3889 5.5759 6.6461 5.8842 8.9666 1.9663 1.7618 2.2023 3.1373 2.8489 5.9034 10.5055 5.6865 1.3841 1.6148 2.2207 1.9012 10.8298 12.3582 3.0257 4.0275 4.3765 2.9469 4.2759 4.1740 3.0080 2.6730 1.4123 1.3783 3.0478 3.2192 2.6939 2.7191 1.5601 1.5582 2.1349 2.1389 3.0242 5.5125 1.6870 1.7368 3.6321 1.9293 1.8923 1.1846 1.2151 1.3931 1.1214 1.1091 1.1917 1.2492 1.3314 1.2175 1.1524 1.2392 1.2423 1.2960 1.3291 1.2378 1.2221 1.0416 1.0412 1.0560 1.0559 1.0810 1.0879 1.0831 1.0931 1.0508 1.0475 1.0610 1.0708 1.8785 1.9197 8.1997 8.2978 1.0318 1.0320 1.0411 1.0735 1.0362 1.0802 1.0692 1.0695 1.0595 1.0599 1.0982 1.1021 1.0971 1.1032 1.0960 1.0956 1.1067 1.1058 1.1035 1.1039 1.1074 1.1074 1.0771 1.0771
irintensity: 3.7100 0.6137 1.4612 2.2452 2.3449 0.8515 0.9542 0.0481 1.3594 0.2644 4.2030 7.0315 0.7329 12.3375 1.7363 9.0190 7.0645 2.2438 0.0393 14.5906 0.5747 0.5990 9.8046 0.5575 0.8784 10.1018 6.6584 2.1442 13.6794 16.4093 0.1716 46.2587 17.8456 17.8175 0.4050 14.9460 1.6764 42.5682 0.1115 9.9175 11.4550 5.2321 151.7377 9.3079 2.2008 67.4343 0.0671 0.3356 87.7111 132.1112 12.7971 69.0383 0.2565 55.8998 0.5274 83.3569 0.1137 3.4270 6.3333 3.6820 1.5665 10.3061 106.8935 1.9196 120.0935 0.4656 27.6182 25.6331 78.2093 0.0452 74.5038 28.1680 22.4869 68.3918 36.8537 102.6452 130.4415 25.9159 108.5483 24.8823 27.0982 2.5523 211.2644 38.7814 19.8000 2.9950 308.3618 6.5534 116.8408 1.0332 129.2475 18.6141 5.4569 10.6911 0.0899 2.4981 19.3806 19.0091 1.8989 1.1758 17.9084 0.0013 32.0929 22.6716 1.6210 1.1759 13.3149 13.9161 65.3032 1.9684 14.1858 8.7770 9.5515 7.1744 7.5455 2.9921 627.9168 103.2201 30.4638 514.6024 65.4233 110.0833 22.5828 2.7901 20.8648 16.1637 8.0035 37.7277 41.1253 26.1557 30.9434 7.6100 34.0339 0.5618 1.7611 2.2232 26.2043 36.2253 40.0698 55.5538 0.4589 0.5117 43.8106 47.3915
temp: 298.150 k
press: 1.00000 atm
elementType: 16 16 8 8 8 8 8 8 8 8 8 8 7 7 6 6 6 6 6 6 6 6 6 6 6 6 1 1 1 1 1 1 1 1 1 1 1 1 1 1 1 1 1 1 1 1 1 1 1 1
symmnumber: 1
zpe: 999913.2 jmol-1
zpe.correction: 0.380847 hartree
zpe.thermalcorrener: 0.413035 hartree
zpe.thermalcorrenthalpy: 0.413979 hartree
zpe.thermalcorrgfe: 0.313935 hartree
zpe.sumelectzpe: -2127.152262 hartree
zpe.sumelectthermal: -2127.120074 hartree
zpe.sumelectthermalent: -2127.119130 hartree
zpe.sumelectthermalfe: -2127.219174 hartree
dipole: 0.3781 -0.4257 0.3321
dipole: 0.6591
quadrupole: -140.0705 -186.5377 -169.8061
quadrupole: 1.6458 7.9613 17.9384
quadrupole: 25.4010 -21.0663 -4.3346 1.6458 7.9613 17.9384
hfenergy: -2127.5331091 hartree
pointgroup: C01 [X(C12H24N2O10S2)]
dipole: -0.1788757 0.1159934 0.147634 debye
polarizability: 284.2513059|31.1331907|264.1045968|11.3911335|-3.1066482|181.8283893 unknown
InChI: InChI=1S/C12H24N2O10S2/c1-5-21-11(15)13-7-9(23-25(3,17)18)10(24-26(4,19)20)8-14-12(16)22-6-2/h9-10,13-14H,5-8H2,1-4H3
charge 0 multiplicity 1
50 atoms
S  1.595065 2.960325 0.196596
S  -1.401283 -3.149374 -0.602962
O  0.450169 1.655981 -0.596653
O  -0.257303 -1.849585 0.205663
O  2.480864 2.207639 1.330515
O  0.679807 4.228543 0.602949
O  -0.485457 -4.421277 -0.998257
O  -2.266691 -2.38699 -1.745041
O  -4.293621 1.005509 -0.469811
O  4.496149 -1.2089 0.077606
O  -3.548453 -0.669825 1.01014
O  3.729353 0.490773 -1.365331
N  -2.209491 1.164163 0.407497
N  2.40764 -1.362613 -0.791635
C  0.193958 0.500705 0.289514
C  0.004648 -0.696217 -0.680386
C  -1.028593 0.787122 1.185608
C  1.229163 -0.985137 -1.572892
C  2.609731 3.320534 -1.362993
C  -2.43537 -3.506861 0.944258
C  -3.3544 0.408899 0.376712
C  3.546506 -0.598794 -0.747604
C  -5.57997 0.270571 -0.6410
C  5.714785 -0.402973 0.384571
C  -6.562412 0.60644 0.484018
C  5.498895 0.423743 1.655333
H  1.080816 0.318287 0.931376
H  -0.880045 -0.512304 -1.325149
H  -0.765084 1.599814 1.888951
H  -1.277272 -0.113168 1.769946
H  1.480589 -0.085284 -2.156874
H  0.966885 -1.797521 -2.276803
H  -2.169154 2.008163 -0.166897
H  2.372625 -2.214391 -0.228789
H  3.12499 2.369372 -1.579287
H  3.284541 4.145207 -1.092391
H  1.872778 3.608263 -2.124932
H  -1.709979 -3.816413 1.708794
H  -3.123113 -4.316055 0.659923
H  -2.935403 -2.549393 1.168743
H  -5.362547 -0.811138 -0.681868
H  -5.940851 0.617098 -1.622664
H  5.937981 0.237055 -0.486929
H  6.505484 -1.160536 0.508753
H  -6.18407 0.242867 1.454028
H  -6.728296 1.695725 0.54883
H  -7.536138 0.120267 0.28645
H  4.67235 1.144193 1.526652
H  5.263559 -0.2296 2.513411
H  6.420868 0.986985 1.893808
