program: Gaussian 09
title: 000261740
version: EM64L-G09RevD.01
frameworkgroup: C1[X(C16H16N6O3)]
method: RPBEPBE
basis: SDD
operation: Freq
keyword: #p
keyword: freq=noraman
keyword: PBEPBE/SDD
title: #p freq=noraman PBEPBE/SDD
converged: YES YES NO NO
title: Mulliken charges:
elementType: O O O N N N N N N C C C C C C C C C C C C C C C C H H H H H H H H H H H H H H H H
charge: -0.207956 -0.456452 -0.277519 -0.410400 -0.001578 -0.014992 -0.408885 -0.030407 -0.610050 -0.390083 -0.523300 -0.440631 0.283563 0.459011 -0.444730 -0.144100 0.173059 -0.423176 -0.354873 0.007289 -0.341316 -0.342902 0.258147 0.159920 0.091154 0.209257 0.233649 0.251222 0.218078 0.228897 0.234819 0.368635 0.260883 0.241756 0.225249 0.329443 0.264504 0.264643 0.364800 0.321770 0.373602
chargesum: 0.00000
title: Mulliken charges with hydrogens summed into heavy atoms:
elementType: O O O N N N N N N C C C C C C C C C C C C C C C C
charge: -0.207956 -0.082850 -0.277519 -0.041764 -0.001578 -0.014992 -0.079442 -0.030407 0.076520 0.052823 -0.054000 0.023085 0.283563 0.459011 -0.183847 -0.144100 0.173059 -0.181420 -0.129624 0.007289 -0.076811 -0.078259 0.258147 0.159920 0.091154
polarizability: 3.94758477e+02 -8.02092597e-02 2.35024381e+02 1.57632475e+01 5.50516200e+00 1.25825049e+02
1716.lowfreq: -14.1858 -2.8823 -0.0001 0.0004 0.0009 3.6610 16.7746 21.3278 38.1001
frequency: 16.6629 21.1824 38.0816 40.1885 54.7961 67.4683 83.7248 92.9763 126.7288 148.3774 152.2290 178.4185 193.5696 227.1509 253.4357 279.9507 301.6411 319.3835 321.0022 331.8954 365.9765 392.5969 418.9744 421.1398 441.0468 465.2273 476.4281 482.3881 496.3440 535.5660 541.5195 561.0530 567.1901 573.4883 588.5707 611.2200 627.9364 630.0749 644.4932 662.6019 677.5882 683.3760 693.0693 699.4210 739.2626 753.2734 756.1900 801.5654 815.8433 817.5579 835.9398 845.2020 856.9672 912.2466 927.5880 953.3848 970.2920 972.7239 983.1607 985.4550 1007.8050 1017.2825 1043.8665 1057.9727 1104.2403 1121.4574 1131.9118 1151.6408 1156.9434 1194.2382 1199.0228 1205.4479 1247.7895 1261.5459 1271.8431 1285.2053 1299.5554 1312.0034 1317.3493 1329.4326 1345.0281 1352.7882 1358.5019 1368.3757 1384.0480 1438.1189 1451.8385 1455.3233 1456.4154 1464.6435 1477.8509 1490.0549 1513.8451 1534.7651 1537.2645 1570.1574 1588.5331 1594.9683 1628.5263 1640.3364 1642.7075 2979.7909 2997.2049 3002.1036 3038.8087 3061.5186 3066.5225 3126.9787 3142.2907 3149.0747 3158.1670 3170.4008 3455.8364 3508.8919 3533.2455 3545.7633 3696.8230
redmass: 7.2710 6.9258 7.4157 5.7721 5.1947 6.5304 7.0173 5.1285 4.3448 5.4013 5.6927 6.6374 5.4988 3.1363 4.4978 3.8693 3.2605 1.2698 5.3147 3.2295 3.5424 4.8498 3.0164 3.4572 7.9715 3.8439 7.0834 5.7256 2.5987 3.4360 3.9525 1.2523 1.2713 3.3007 4.8347 3.1546 1.8302 5.6384 3.5907 1.3752 3.8804 3.7835 3.0302 9.0271 4.4446 2.6768 4.0661 4.4425 9.2820 1.3511 3.7159 1.6993 3.1926 4.4438 1.5280 2.0996 1.3639 3.1256 3.2145 1.5535 2.7641 2.2141 2.1728 2.6360 3.0149 2.9221 1.7055 1.5289 1.6052 2.3031 1.2146 1.3321 2.2741 2.9296 1.7740 1.8431 1.3975 1.4316 2.1484 2.4243 2.5177 1.8096 1.5175 2.1044 2.4628 5.2801 3.6773 2.6316 1.1284 1.3669 1.1311 1.7587 8.5648 3.7832 4.7314 3.6928 5.4706 1.9368 6.5898 7.1490 2.5306 1.0603 1.0618 1.0619 1.1005 1.1016 1.1015 1.0889 1.0874 1.0932 1.0956 1.0960 1.0783 1.0778 1.0640 1.0458 1.1054
irintensity: 2.4793 1.1117 3.7517 0.8566 1.6284 3.6521 0.2519 1.2277 0.8960 0.1087 2.4505 4.2669 0.5352 3.5873 2.2940 2.2460 4.5831 39.0403 5.2820 16.8591 2.5679 2.4712 2.1129 5.8919 3.1691 5.0165 0.9366 16.5761 49.2485 19.4072 39.0439 262.7457 78.2449 18.7986 13.9201 12.8116 50.6664 1.4738 16.1173 66.6293 16.6529 51.0919 25.8611 24.1170 3.5108 10.3300 13.4723 2.7230 6.1391 4.2231 7.8215 61.2864 12.4873 11.4060 12.5175 4.8271 1.9682 8.5420 161.0705 36.5449 235.5908 30.7855 16.0098 0.4367 1.7130 5.4088 12.3882 279.5454 34.7958 18.3401 6.4738 41.7895 2.0766 5.1375 50.5660 30.3845 6.1498 16.5996 76.3005 205.4688 87.1411 13.6913 27.1131 102.1607 6.7067 190.2805 23.9671 48.5025 16.2846 5.9068 31.8162 120.3203 128.3707 350.7468 56.6739 29.9532 710.7763 78.5977 978.1990 129.9836 414.8204 23.9147 59.7745 20.5813 17.1160 20.2568 57.4397 7.2430 17.3771 12.3595 7.0064 6.4566 409.8850 37.8338 44.6389 170.6942 50.0603
temp: 298.150 k
press: 1.00000 atm
elementType: 8 8 8 7 7 7 7 7 7 6 6 6 6 6 6 6 6 6 6 6 6 6 6 6 6 1 1 1 1 1 1 1 1 1 1 1 1 1 1 1 1
symmnumber: 1
zpe: 819901.8 jmol-1
zpe.correction: 0.312284 hartree
zpe.thermalcorrener: 0.334206 hartree
zpe.thermalcorrenthalpy: 0.335151 hartree
zpe.thermalcorrgfe: 0.258778 hartree
zpe.sumelectzpe: -1171.738040 hartree
zpe.sumelectthermal: -1171.716118 hartree
zpe.sumelectthermalent: -1171.715174 hartree
zpe.sumelectthermalfe: -1171.791547 hartree
dipole: 12.9436 6.3740 -0.2479
dipole: 14.4300
quadrupole: -101.3200 -148.3963 -147.8634
quadrupole: -20.0559 -9.4155 2.0754
quadrupole: 31.2065 -15.8697 -15.3368 -20.0559 -9.4155 2.0754
hfenergy: -1172.0503244 hartree
pointgroup: C01 [X(C16H16N6O3)]
dipole: -5.3432858 1.2264523 -1.4750362 debye
polarizability: 387.9971064|39.0415566|191.2798507|16.9288043|-52.9917417|176.3309493 unknown
InChI: InChI=1S/C16H16N6O3/c17-16-21-13-12(14(23)22-16)20-11(8-19-13)2-1-7-18-10-5-3-9(4-6-10)15(24)25/h3-6,8,18,21,24H,1-2,7,17H2
charge 0 multiplicity 1
41 atoms
O  -1.666831 -2.170256 1.137553
O  7.243212 1.286619 0.028312
O  6.825253 0.373723 2.123888
N  0.969845 0.042334 -0.723345
N  -1.879805 0.441988 0.00741
N  -4.49716 1.465618 -0.431433
N  -5.388838 -0.516378 0.503732
N  -4.002265 -2.328505 1.305505
N  -6.323703 -2.473499 1.446615
C  -0.013066 1.930736 -2.12008
C  -0.819514 2.472094 -0.900452
C  0.387604 0.430238 -2.008091
C  -2.059601 1.678416 -0.553906
C  2.288161 0.222572 -0.346393
C  -3.382239 2.170143 -0.769457
C  -2.974152 -0.287772 0.34956
C  -4.27955 0.243239 0.129898
C  2.704087 -0.190297 0.964314
C  3.268534 0.802254 -1.216751
C  -2.806241 -1.660316 0.95803
C  4.028851 -0.0257 1.37746
C  4.596522 0.95619 -0.792427
C  5.001239 0.55178 0.508854
C  -5.193624 -1.777274 1.086137
C  6.380803 0.70451 0.991119
H  -0.59576 2.063698 -3.053784
H  0.894881 2.556569 -2.212579
H  -0.150424 2.457442 -0.020084
H  -1.094038 3.525728 -1.092598
H  1.084622 0.184516 -2.832004
H  -0.508476 -0.196586 -2.158159
H  0.29019 -0.29866 -0.031949
H  -3.547307 3.154035 -1.220073
H  1.967956 -0.649642 1.634884
H  2.987983 1.128816 -2.223161
H  -6.313108 -0.108941 0.334856
H  4.345637 -0.342593 2.376863
H  5.340481 1.397056 -1.462757
H  -6.17223 -3.387939 1.868166
H  -7.270029 -2.1226 1.322582
H  8.1481 1.344948 0.436141
