program: Gaussian 09
title: 000261716
version: EM64L-G09RevD.01
frameworkgroup: C1[X(C14H14N4O)]
method: RPBEPBE
basis: SDD
operation: Freq
keyword: #p
keyword: freq=noraman
keyword: PBEPBE/SDD
title: #p freq=noraman PBEPBE/SDD
converged: YES YES NO NO
title: Mulliken charges:
elementType: O N N N N C C C C C C C C C C C C C C H H H H H H H H H H H H H H
charge: -0.205498 -0.175536 -0.357323 -0.026650 -0.006065 -0.102325 -0.554021 0.332907 -0.714863 0.490917 -0.237652 -0.133034 -0.438930 -0.397293 0.025920 -0.243981 -0.240556 -0.223756 -0.236815 0.234263 0.219072 0.229060 0.232784 0.222337 0.249188 0.267749 0.340340 0.246390 0.250384 0.235666 0.235992 0.240110 0.241221
chargesum: 0.00000
title: Mulliken charges with hydrogens summed into heavy atoms:
elementType: O N N N N C C C C C C C C C C C C C C
charge: -0.205498 -0.175536 -0.016983 -0.026650 -0.006065 0.131938 -0.105890 0.332907 -0.010554 0.490917 0.030097 -0.133034 -0.192540 -0.146910 0.025920 -0.008315 -0.004563 0.016354 0.004406
polarizability: 1.78635030e+02 -6.58475615e+00 2.01038321e+02 3.03094962e+01 7.54920469e+00 1.29715046e+02
1716.lowfreq: -6.2551 -4.9640 -0.0006 0.0004 0.0009 6.8451 24.8076 47.6957 53.4340
frequency: 24.6719 47.6831 53.3728 70.0302 92.7515 119.4868 144.3976 189.0687 231.1743 244.0516 260.4628 286.3272 331.1847 340.8307 367.8175 401.8868 421.3712 487.1340 496.5801 512.3130 554.1473 577.9184 592.4322 600.9593 616.7937 638.9561 651.4668 660.9028 688.9621 708.3283 758.3193 760.2882 788.4306 809.6702 859.8676 864.7935 885.0135 891.4125 903.7179 931.2507 933.9603 981.0991 990.2169 991.8949 1003.8627 1025.7942 1031.3988 1070.1144 1075.7592 1104.9262 1110.7970 1162.1682 1174.5422 1177.0315 1189.9681 1216.3581 1222.4844 1273.7837 1282.8612 1315.5181 1326.9182 1333.9478 1338.3899 1359.6851 1373.2172 1380.1986 1398.1062 1418.6651 1441.0147 1460.1473 1473.8404 1483.1620 1484.6243 1510.4011 1525.1354 1589.4759 1593.7190 1610.2270 1632.3171 2979.3206 2993.2192 2996.7333 3058.0838 3091.5516 3103.2280 3110.0060 3122.1336 3129.9473 3139.3754 3152.0845 3170.0774 3248.9224 3477.5175
redmass: 5.8008 5.8575 4.1473 5.7799 3.6739 6.5017 4.6502 6.2379 4.5838 1.0715 2.9969 4.9759 5.5578 2.4539 4.1444 2.8305 3.6968 10.2485 3.4194 3.3726 3.7523 6.1133 4.3625 1.2272 6.3079 3.3621 5.0231 11.7462 6.0361 1.9151 1.8078 1.9725 3.6734 3.3057 1.5479 3.3524 2.2466 1.4670 1.5189 1.6108 5.1398 1.4767 4.7791 3.5044 1.3226 2.2126 1.8224 3.4531 1.7162 1.9723 2.5479 2.3559 1.2919 1.3742 1.1175 2.4573 1.7086 2.6424 1.4274 1.5454 3.3570 1.2948 2.7644 1.4501 1.4478 5.5857 1.2149 3.6945 2.0987 1.1190 1.0493 1.5180 1.3852 3.9099 7.3102 5.9651 6.4834 6.0640 12.4682 1.0838 1.0525 1.0452 1.1024 1.0996 1.1008 1.0885 1.0923 1.0877 1.0908 1.0953 1.1012 1.0976 1.0800
irintensity: 5.6359 0.3903 2.1753 0.5422 0.6349 0.8698 1.5226 2.2985 3.5653 0.1319 2.4704 1.9170 0.4506 0.2924 1.7131 0.0670 0.9741 2.5466 8.6664 7.3177 0.6659 6.6588 1.5389 139.3782 0.1089 7.1240 9.6742 2.1609 17.1970 56.1917 21.6231 48.1011 0.8412 4.4278 3.0828 2.6523 3.0854 8.3742 0.2104 9.1922 34.5005 0.6818 0.3776 23.1769 0.3827 3.0102 8.2268 10.8851 3.5101 28.8549 24.6179 12.8830 14.5102 26.0692 0.9329 0.4591 39.6129 0.4593 6.4443 10.7326 46.4062 1.0892 10.9464 15.5888 2.0116 1.4084 22.6123 5.4476 11.2609 10.8267 12.3894 12.7713 10.7064 19.5976 286.3437 4.5913 54.9449 6.3543 411.9498 9.5346 6.2130 38.6700 11.3592 25.4634 21.4345 9.3328 17.5388 4.2698 5.6576 22.9926 12.7950 0.0805 133.4066
temp: 298.150 k
press: 1.00000 atm
elementType: 8 7 7 7 7 6 6 6 6 6 6 6 6 6 6 6 6 6 6 1 1 1 1 1 1 1 1 1 1 1 1 1 1
symmnumber: 1
zpe: 680113.9 jmol-1
zpe.correction: 0.259042 hartree
zpe.thermalcorrener: 0.274958 hartree
zpe.thermalcorrenthalpy: 0.275902 hartree
zpe.thermalcorrgfe: 0.214597 hartree
zpe.sumelectzpe: -834.762142 hartree
zpe.sumelectthermal: -834.746226 hartree
zpe.sumelectthermalent: -834.745281 hartree
zpe.sumelectthermalfe: -834.806586 hartree
dipole: -11.8238 4.3118 -2.9608
dipole: 12.9291
quadrupole: -149.8675 -100.8054 -105.7739
quadrupole: 12.8086 -1.7048 -0.5998
quadrupole: -31.0519 18.0102 13.0417 12.8086 -1.7048 -0.5998
hfenergy: -835.0211836 hartree
pointgroup: C01 [X(C14H14N4O1)]
dipole: 4.5234688 -1.8252964 -1.4425614 debye
polarizability: 173.4715212|-8.2369841|200.5331122|-33.4859445|-9.4321199|135.3837639 unknown
InChI: InChI=1S/C14H14N4O/c1-10(7-11-5-3-2-4-6-11)18-9-17-12-13(18)15-8-16-14(12)19/h2-6,8-10,15H,7H2,1H3
charge 0 multiplicity 1
33 atoms
O  -4.044769 1.479705 0.735505
N  -0.524897 -1.526272 -0.061824
N  -0.429548 0.72049 -1.188636
N  -2.50268 -1.209503 1.064325
N  -2.321883 2.160455 -0.730089
C  0.6984 -2.196772 -0.580285
C  1.956274 -1.84273 0.27726
C  -0.979255 -0.245777 -0.363231
C  0.49236 -3.721682 -0.676198
C  2.336361 -0.372833 0.198985
C  -1.495533 -2.058316 0.824206
C  -2.201273 -0.05489 0.316137
C  2.975997 0.1375 -0.964368
C  2.01567 0.526041 1.247098
C  -2.957817 1.199266 0.169812
C  -1.170984 1.908913 -1.310229
C  3.277294 1.514881 -1.079405
C  2.316445 1.903036 1.136293
C  2.943052 2.402951 -0.028667
H  0.857564 -1.80665 -1.60625
H  2.786573 -2.473834 -0.094438
H  1.756791 -2.143514 1.322353
H  1.34434 -4.173652 -1.212779
H  0.442478 -4.191825 0.3221
H  -0.432324 -3.965911 -1.226085
H  -1.411488 -3.058617 1.239163
H  0.534965 0.670495 -1.532348
H  3.263278 -0.549506 -1.771285
H  1.521726 0.148406 2.1501
H  -0.708975 2.666079 -1.956262
H  3.78217 1.891416 -1.976074
H  2.056694 2.584005 1.953687
H  3.175796 3.469743 -0.114169
