program: Gaussian 09
title: 000261703
version: EM64L-G09RevD.01
frameworkgroup: C1[X(C16H12O4)]
method: RPBEPBE
basis: SDD
operation: Freq
keyword: #pfreq=noraman
keyword: PBEPBE/SDD
title: #p freq=noraman PBEPBE/SDD
converged: YES YES NO NO
title: Mulliken charges:
elementType: O O O O C C C C C C C C C C C C C C C C H H H H H H H H H H H H
charge: -0.266702 -0.255027 -0.470433 -0.262530 0.195107 0.166402 0.546772 -0.493406 -0.341740 -0.403950 -0.203264 -0.296154 0.145191 -0.331926 0.104966 0.222923 -0.320143 -0.406317 -0.260733 -0.204099 0.260306 0.255105 0.244370 0.240483 0.241573 0.272722 0.290309 0.287405 0.212852 0.233918 0.231693 0.364327
chargesum: 0.00000
title: Mulliken charges with hydrogens summed into heavy atoms:
elementType: O O O O C C C C C C C C C C C C C C C C
charge: -0.266702 -0.255027 -0.106106 -0.262530 0.195107 0.166402 0.546772 -0.233101 -0.086635 -0.159580 0.278792 -0.023432 0.145191 -0.041617 0.104966 0.222923 -0.032739 -0.193465 -0.026814 0.027593
polarizability: 4.09767261e+02 4.23587397e+00 2.00633027e+02 8.55513710e-01 1.95083029e-01 7.56256624e+01
1716.lowfreq: -36.7096 -1.9434 -0.0005 0.0008 0.0008 4.9921 8.5497 14.6032 29.3507
frequency: -36.6771 12.3146 29.2027 42.2980 67.9655 110.0306 151.0167 160.5118 196.2002 206.0842 229.0166 251.8446 286.6834 357.9111 363.0644 379.2232 380.7270 423.1050 439.3539 464.8340 510.2785 524.2262 540.5879 548.0102 592.2199 599.0322 638.8721 672.1210 680.1081 721.7662 739.0891 754.5191 767.3983 779.1125 803.7911 818.4991 840.2090 854.2676 855.6839 878.6137 915.2032 936.2845 942.6772 960.0048 979.1302 1004.4767 1021.2970 1023.2900 1055.3032 1060.3817 1064.0823 1080.7568 1120.4054 1131.0873 1155.8413 1172.7965 1195.3265 1202.7451 1234.8185 1245.3211 1267.1774 1287.7678 1310.8329 1338.6512 1365.4739 1388.9882 1394.0554 1427.0896 1455.8995 1477.8584 1481.0463 1486.4494 1506.2251 1590.5898 1599.7562 1609.8850 1622.0036 1631.7686 3016.7352 3096.5133 3101.0065 3105.0154 3140.1418 3145.4499 3152.3956 3169.9827 3179.7363 3184.7661 3188.3619 3569.4989
redmass: 2.3002 5.5887 5.9250 6.3948 8.8471 4.3620 4.2075 6.2619 7.7622 4.5199 5.4263 4.0767 7.5118 4.2202 7.0748 1.1533 6.0490 2.8828 3.4715 5.0872 7.0947 3.5306 7.6851 4.8834 6.4152 3.9725 6.6370 3.9753 9.7314 3.8200 7.6089 2.4104 1.6070 6.7185 6.0355 1.4021 9.1822 6.5646 1.4612 1.5037 1.8830 3.6381 1.3913 1.3557 4.6630 1.3411 1.1781 3.9318 2.4361 3.6921 1.4596 2.1009 1.0373 1.4692 1.2559 1.0787 1.7037 2.5227 2.6253 1.8260 1.6622 1.5070 1.6676 2.1256 1.2926 5.8769 3.7035 2.5765 4.2707 2.3637 2.2343 1.4239 8.2806 6.5119 7.2994 6.4585 7.9531 5.4259 1.0536 1.1188 1.0893 1.0891 1.0878 1.0902 1.0927 1.1002 1.0931 1.0957 1.0909 1.0657
irintensity: 13.8140 0.0303 2.6137 0.5131 2.7212 0.0162 0.1242 0.6862 0.2399 0.0988 0.1138 4.0119 10.4747 0.2647 2.3122 125.1183 14.2514 4.7348 3.3192 16.9436 25.8753 11.5043 4.6960 18.2093 3.8833 10.7137 7.3690 4.7085 0.4277 0.3778 1.7014 24.8070 82.1141 10.7284 16.7365 42.0017 26.4519 30.2452 0.2539 23.8405 3.3284 4.4354 4.4549 1.2162 167.8570 0.3382 54.8482 74.5034 12.9045 28.9597 4.1756 122.7929 0.0156 30.1249 37.0457 11.8580 20.6631 136.9462 113.6945 293.2936 73.9036 118.2374 18.6234 88.2832 0.2916 25.6141 117.0306 38.2822 222.9375 158.9704 8.9521 82.2124 238.4707 47.8203 93.2060 170.2647 34.2359 255.4683 145.5604 30.0824 1.8450 13.1291 9.5385 5.2453 3.0015 41.3022 5.9018 2.8662 29.1486 32.6131
temp: 298.150 k
press: 1.00000 atm
elementType: 8 8 8 8 6 6 6 6 6 6 6 6 6 6 6 6 6 6 6 6 1 1 1 1 1 1 1 1 1 1 1 1
symmnumber: 1
zpe: 624822.4 jmol-1
zpe.correction: 0.237982 hartree
zpe.thermalcorrener: 0.254069 hartree
zpe.thermalcorrenthalpy: 0.255013 hartree
zpe.thermalcorrgfe: 0.191834 hartree
zpe.sumelectzpe: -916.358379 hartree
zpe.sumelectthermal: -916.342293 hartree
zpe.sumelectthermalent: -916.341349 hartree
zpe.sumelectthermalfe: -916.404527 hartree
dipole: -1.0766 -4.7577 0.0951
dipole: 4.8789
quadrupole: -87.4107 -104.3000 -120.3162
quadrupole: -9.5683 -0.0889 0.2485
quadrupole: 16.5983 -0.2910 -16.3072 -9.5683 -0.0889 0.2485
hfenergy: -916.5963613 hartree
pointgroup: C01 [X(C16H12O4)]
dipole: 0.3517199 1.7592987 -0.6823868 debye
polarizability: 407.4557497|2.8369637|183.7309679|-26.3855223|-43.2392222|94.8392324 unknown
InChI: InChI=1S/C16H12O4/c17-13-4-2-1-3-12(13)14(18)7-5-11-6-8-15-16(9-11)20-10-19-15/h1-9,17H,10H2
charge 0 multiplicity 1
32 atoms
O  4.08708 1.951708 -0.970082
O  5.808386 0.353875 -0.462387
O  -2.225128 1.796573 -0.537832
O  -2.133569 -2.213371 1.098379
C  3.518136 0.757301 -0.459018
C  4.536622 -0.180583 -0.162765
C  1.831334 -0.810289 0.267099
C  2.17147 0.482388 -0.260049
C  4.241311 -1.446605 0.348921
C  2.871131 -1.74317 0.558151
C  5.556511 1.7364 -0.960189
C  0.447426 -1.213316 0.52079
C  -3.277762 -0.213077 0.416454
C  -0.684667 -0.462279 0.320264
C  -2.018178 -1.026426 0.632187
C  -3.382054 1.10422 -0.125738
C  -4.494484 -0.847134 0.80225
C  -4.643764 1.737187 -0.264206
C  -5.748832 -0.228582 0.66908
C  -5.82347 1.0785 0.130269
H  1.403853 1.222205 -0.498194
H  5.029156 -2.168712 0.57515
H  2.596324 -2.724927 0.959045
H  6.023708 2.455115 -0.264938
H  5.941534 1.818983 -1.990467
H  0.294885 -2.228461 0.91591
H  -0.648617 0.556537 -0.06823
H  -4.397937 -1.857534 1.213523
H  -4.696917 2.751211 -0.683966
H  -6.658454 -0.752209 0.979226
H  -6.790042 1.581434 0.017407
H  -2.467893 2.688339 -0.892041
