program: Gaussian 09
title: 000261711
version: EM64L-G09RevD.01
frameworkgroup: C1[X(C13H15ClN4)]
method: RPBEPBE
basis: SDD
operation: Freq
keyword: #p
keyword: freq=noraman
keyword: PBEPBE/SDD
title: #p freq=noraman PBEPBE/SDD
converged: YES YES NO NO
title: Mulliken charges:
elementType: Cl N N N N C C C C C C C C C C C C C H H H H H H H H H H H H H H H
charge: -0.056574 -0.383408 -0.058884 -0.652521 0.049475 -0.561273 -0.409827 0.477925 -0.409754 -0.407106 0.431410 -0.411653 -0.364780 0.191069 0.285894 -0.804996 -0.284358 -0.379385 0.212500 0.246754 0.256477 0.225271 0.315601 0.244316 0.230885 0.232051 0.228382 0.236189 0.224385 0.224915 0.317707 0.306445 0.246869
chargesum: 0.00000
title: Mulliken charges with hydrogens summed into heavy atoms:
elementType: Cl N N N N C C C C C C C C C C C C C
charge: -0.056574 -0.067807 -0.058884 -0.028369 0.049475 -0.102019 0.071920 0.477925 -0.165438 -0.176222 0.431410 -0.179602 -0.136398 0.191069 0.285894 -0.119508 -0.284358 -0.132516
polarizability: 2.26304517e+02 -1.62167085e+00 1.93469819e+02 3.62473060e+01 5.02292758e+00 1.18502717e+02
1716.lowfreq: -12.4052 -6.2852 -0.0010 -0.0006 0.0016 6.2721 17.0512 19.6975 24.5839
frequency: 16.0962 19.6321 24.5627 29.6058 59.1739 78.7600 105.0185 165.5940 195.4090 212.7818 243.5940 265.7786 292.1562 315.8484 342.8560 358.2437 364.5605 380.1447 406.0120 441.2387 465.3170 493.5527 536.0087 549.2709 567.7410 577.5497 593.3616 618.1859 639.4197 671.8918 707.4787 730.6671 756.7448 779.9389 806.5835 807.6665 836.4026 853.8195 894.2030 898.9408 948.4350 956.8071 975.3862 982.5821 1013.8061 1024.0171 1047.8698 1073.3804 1077.7883 1122.7172 1149.9475 1183.9097 1192.1367 1199.2662 1212.5988 1223.3026 1257.8307 1302.9727 1309.2141 1316.8388 1331.3209 1357.6358 1373.7143 1393.4986 1398.7354 1406.2761 1439.9591 1444.0915 1465.4240 1470.9063 1472.5386 1474.7058 1508.7090 1543.6882 1562.5012 1581.8287 1624.9746 1631.5246 2975.9350 2996.4995 3010.5628 3055.6672 3063.3206 3084.0138 3096.5351 3107.1124 3113.6575 3130.8948 3139.0471 3178.5216 3504.8016 3509.0336 3641.3388
redmass: 1.8339 2.0093 4.2740 3.3443 5.4000 4.6498 4.9633 4.7813 4.2403 6.8552 4.9792 2.9161 2.5855 4.3534 1.5679 2.9689 3.8603 2.4043 2.8566 3.5928 3.2728 4.3635 2.8475 2.4293 2.3121 1.8890 2.8095 2.3548 6.6045 3.8329 3.5687 2.9512 9.7045 4.9360 4.5717 2.0407 2.2181 1.2524 1.4549 2.2840 1.7806 1.6976 1.3831 1.4707 2.8258 1.7420 1.5527 2.1408 4.0580 1.3459 2.7931 1.3648 1.1097 2.6343 3.1984 2.4081 1.4859 3.4634 1.5774 1.4004 2.1072 1.3702 4.5539 1.7880 1.2415 2.7630 1.6544 1.8433 2.1362 1.0679 1.1081 1.0940 2.7449 3.6120 4.6408 5.9090 6.3320 1.2797 1.0379 1.0613 1.0650 1.0963 1.0998 1.0993 1.1009 1.0869 1.0873 1.0962 1.0972 1.0924 1.0509 1.0696 1.1020
irintensity: 0.3306 1.5030 1.5215 0.6877 0.1913 1.2522 2.7539 1.0751 0.8829 0.8697 1.8545 2.3769 4.1685 4.0176 65.0774 19.7368 7.7701 1.3118 0.0253 3.1469 6.4682 7.5683 32.3791 24.9810 48.9214 211.0617 34.7141 69.3466 0.2780 12.3192 4.6798 11.4969 5.8641 17.3353 10.9691 25.2865 44.9868 0.2989 12.8535 4.6489 4.0092 3.1916 0.1901 0.1858 2.5228 7.1982 16.9292 136.3611 30.5726 25.3628 13.6805 1.8179 0.8070 13.8529 0.3898 1.4024 20.2097 7.1029 25.4292 24.7670 28.5948 34.1647 3.8603 59.6348 9.9001 1.3785 50.6142 49.1297 62.0231 7.7987 13.5272 11.5189 50.0226 556.5448 43.7211 0.7298 2.7409 122.9620 38.4459 27.6302 38.4633 21.8846 23.4246 18.6451 10.1154 10.2291 18.1250 45.4100 2.8121 14.0781 26.4280 38.2155 30.7812
temp: 298.150 k
press: 1.00000 atm
elementType: 17 7 7 7 7 6 6 6 6 6 6 6 6 6 6 6 6 6 1 1 1 1 1 1 1 1 1 1 1 1 1 1 1
symmnumber: 1
zpe: 686426.8 jmol-1
zpe.correction: 0.261446 hartree
zpe.thermalcorrener: 0.278839 hartree
zpe.thermalcorrenthalpy: 0.279783 hartree
zpe.thermalcorrgfe: 0.212249 hartree
zpe.sumelectzpe: -1182.154228 hartree
zpe.sumelectthermal: -1182.136835 hartree
zpe.sumelectthermalent: -1182.135891 hartree
zpe.sumelectthermalfe: -1182.203425 hartree
dipole: 4.9099 0.8528 3.2817
dipole: 5.9669
quadrupole: -126.6037 -106.5890 -110.3433
quadrupole: 1.4605 -2.7117 1.8400
quadrupole: -12.0918 7.9230 4.1687 1.4605 -2.7117 1.8400
hfenergy: -1182.4156741 hartree
pointgroup: C01 [X(C13H15Cl1N4)]
dipole: -1.7486614 -0.4597836 1.4972658 debye
polarizability: 212.9925689|5.457499|191.7452358|-50.2933775|11.9882425|133.5392478 unknown
InChI: InChI=1S/C13H15ClN4/c1-9-2-4-10(5-3-9)6-7-16-13-11(15)12(14)17-8-18-13/h2-5,8,16H,6-7,15H2,1H3
charge 0 multiplicity 1
33 atoms
Cl 4.319539 -2.399984 -1.486361
N  0.722287 0.576525 0.870449
N  2.267241 1.612935 -0.612429
N  2.001898 -1.930481 0.511121
N  3.945835 0.299948 -1.761072
C  -1.077779 2.13369 -0.006783
C  0.00251 1.844477 1.081528
C  -2.154319 1.06149 -0.060457
C  -2.028285 -0.05929 -0.92117
C  -3.290824 1.119643 0.789011
C  -4.138346 -1.024391 -0.085798
C  -3.002702 -1.083982 -0.932076
C  -4.263585 0.097251 0.776351
C  1.809441 0.487147 0.012531
C  2.449755 -0.799503 -0.173347
C  -5.20456 -2.106385 -0.118168
C  3.49783 -0.788702 -1.115358
C  3.325262 1.47319 -1.458626
H  -1.524612 3.120129 0.223273
H  -0.560603 2.22523 -0.978944
H  0.748497 2.655203 1.073437
H  -0.471494 1.804365 2.079834
H  0.174513 -0.27982 0.997368
H  -1.169457 -0.121738 -1.60114
H  -3.417587 1.979031 1.46014
H  -2.882062 -1.936785 -1.611442
H  -5.135592 0.170658 1.43858
H  -6.103979 -1.763232 -0.665196
H  -4.840099 -3.018704 -0.621287
H  -5.530787 -2.385632 0.900249
H  2.456406 -2.817681 0.292322
H  1.638238 -1.820855 1.457581
H  3.699627 2.375851 -1.94712
