program: Gaussian 09
title: 000261678
version: EM64L-G09RevD.01
frameworkgroup: C1[X(C12H18O2)]
method: RPBEPBE
basis: SDD
operation: Freq
keyword: #pfreq=noraman
keyword: PBEPBE/SDD
title: #p freq=noraman PBEPBE/SDD
converged: YES YES NO NO
title: Mulliken charges:
elementType: O O C C C C C C C C C C C C H H H H H H H H H H H H H H H H H H
charge: -0.427652 -0.427766 -0.083677 0.016992 -0.278686 -0.288672 0.371733 -0.621106 -0.639020 -0.525189 -0.240290 -0.226276 -0.472173 -0.471608 0.221770 0.194944 0.238149 0.239206 0.240522 0.229921 0.243031 0.231303 0.216993 0.250266 0.241025 0.234161 0.237854 0.194676 0.235240 0.194165 0.334452 0.335715
chargesum: 0.00000
title: Mulliken charges with hydrogens summed into heavy atoms:
elementType: O O C C C C C C C C C C C C
charge: -0.093200 -0.092051 0.138093 0.211936 -0.040537 -0.049466 0.371733 -0.150664 -0.164687 -0.057930 0.000735 0.007885 -0.039643 -0.042203
polarizability: 1.45125318e+02 -1.76336138e+00 1.16651120e+02 2.27556788e+00 2.92467974e+00 1.12563358e+02
1716.lowfreq: -20.2818 -5.4296 -0.0005 -0.0001 0.0005 13.9088 55.4067 86.2371 101.8164
frequency: 54.4280 86.2031 101.4198 119.5117 155.3354 203.4923 229.7623 249.5984 262.1525 290.8278 307.2781 349.1397 410.6086 438.7245 444.7152 510.1515 533.3021 549.0215 616.8824 642.8613 717.1310 735.3294 749.4205 793.3332 816.2148 841.2367 869.2239 886.1964 890.8142 901.5484 918.8570 921.9304 942.1418 958.7601 961.1189 978.1063 986.2623 1017.7557 1027.2473 1042.0582 1070.4940 1078.4750 1089.8146 1099.2445 1110.6510 1116.6116 1124.1376 1157.1760 1175.8356 1195.5725 1202.5679 1215.9331 1228.1773 1246.3272 1254.6047 1265.3238 1271.2783 1289.3091 1300.5690 1306.5322 1308.1674 1323.3243 1363.3669 1376.5294 1397.5460 1411.6482 1466.5972 1475.7928 1479.3138 1481.7593 1488.2077 1572.9080 2922.7573 2929.6600 2934.8761 2948.0930 2987.9869 2989.5619 3008.7501 3063.7292 3066.0218 3069.2935 3073.2240 3075.5170 3085.1680 3088.8640 3150.9554 3184.1306 3561.8173 3562.3495
redmass: 3.7340 3.7820 1.9701 3.6318 2.1865 1.2893 2.3077 3.3860 1.9117 4.0736 4.0080 2.3131 2.1453 2.5600 3.1536 2.1982 2.5300 3.0838 2.5418 3.5953 2.1035 3.0958 4.3445 3.5075 2.5833 2.4788 2.5239 2.1652 2.0284 1.5481 1.5957 2.5889 2.3840 2.0860 3.5434 3.1833 1.9361 1.6728 1.4744 1.6913 1.5476 1.4845 1.6460 1.9773 1.2147 1.7828 1.5274 1.6427 1.8935 1.3924 1.5281 1.4122 1.5488 1.5407 1.3688 1.6616 1.6415 1.6082 1.4698 1.3170 1.4863 1.5385 1.1774 1.2168 1.1437 1.1791 1.0759 1.0789 1.1010 1.0885 1.0908 5.7731 1.0708 1.0808 1.0698 1.0835 1.0645 1.0629 1.0608 1.0962 1.1000 1.0963 1.0934 1.0893 1.0993 1.0969 1.0871 1.1090 1.0662 1.0661
irintensity: 4.1859 0.2194 28.7705 2.8141 67.7528 127.6080 38.1391 19.9862 30.2503 3.6948 1.0486 20.4558 2.4424 6.4675 0.1425 3.4869 5.2205 9.1272 1.5712 0.1291 37.4809 17.2047 2.2805 12.7201 11.1637 2.3966 4.4149 2.8992 9.7399 21.7858 2.3301 2.1943 4.7386 9.2236 88.2428 59.3662 15.0743 6.3976 3.6676 43.9563 4.3880 5.2903 8.8193 17.3952 4.6369 10.7664 14.9792 1.0087 0.3039 15.5486 4.4091 5.5232 8.3912 6.5343 1.8564 3.3309 15.8113 9.3634 7.0175 2.6349 1.4619 1.6397 19.0920 19.5245 0.8647 1.2466 10.1652 10.6879 10.0321 8.2714 1.9535 3.1471 55.7125 11.1592 76.9556 20.3245 11.8518 71.4610 54.0419 2.4897 6.4018 35.1184 23.0383 63.7037 31.2396 39.6204 7.2410 22.7269 4.3177 6.4624
temp: 298.150 k
press: 1.00000 atm
elementType: 8 8 6 6 6 6 6 6 6 6 6 6 6 6 1 1 1 1 1 1 1 1 1 1 1 1 1 1 1 1 1 1
symmnumber: 1
zpe: 724677.7 jmol-1
zpe.correction: 0.276015 hartree
zpe.thermalcorrener: 0.289075 hartree
zpe.thermalcorrenthalpy: 0.290019 hartree
zpe.thermalcorrgfe: 0.237056 hartree
zpe.sumelectzpe: -617.339079 hartree
zpe.sumelectthermal: -617.326020 hartree
zpe.sumelectthermalent: -617.325076 hartree
zpe.sumelectthermalfe: -617.378038 hartree
dipole: -0.1840 -0.0769 0.1463
dipole: 0.2473
quadrupole: -85.2234 -95.0145 -81.5543
quadrupole: 0.0237 0.3246 -0.2150
quadrupole: 2.0407 -7.7504 5.7098 0.0237 0.3246 -0.2150
hfenergy: -617.6150946 hartree
pointgroup: C01 [X(C12H18O2)]
dipole: -0.0716258 0.0217015 -0.0621733 debye
polarizability: 145.1881888|1.2070701|117.4125547|-2.1683179|2.2116564|111.7390524 unknown
InChI: InChI=1S/C12H18O2/c13-6-12(7-14)4-10-8-1-2-9(3-8)11(10)5-12/h1-2,8-11,13-14H,3-7H2
charge 0 multiplicity 1
32 atoms
O  3.253954 -1.864087 0.396149
O  3.403052 1.735315 -0.150084
C  -0.734679 -0.702329 -0.272296
C  -0.693182 0.832205 -0.045199
C  -2.239892 -0.937008 -0.723196
C  -2.212125 1.205709 0.137488
C  1.561989 -0.010548 0.00011
C  0.640763 -0.925918 -0.934131
C  0.583179 0.969313 0.800102
C  -2.701926 0.48965 -1.185666
C  -2.950675 -0.967162 0.651915
C  -2.889452 0.294829 1.173273
C  2.33869 -0.887684 1.012943
C  2.529031 0.808808 -0.890869
H  -0.646841 -1.194577 0.719149
H  -0.432874 1.298981 -1.02113
H  -2.4411 -1.780986 -1.399288
H  -2.427221 2.282102 0.222149
H  0.996936 -1.970456 -0.917504
H  0.665512 -0.571425 -1.983489
H  1.010233 1.986053 0.844429
H  0.430927 0.612561 1.837817
H  -2.196558 0.857943 -2.097326
H  -3.795286 0.546641 -1.319335
H  -3.304852 -1.875228 1.14877
H  -3.209652 0.611472 2.169734
H  1.629886 -1.51291 1.581125
H  2.880326 -0.246873 1.745281
H  1.948974 1.471291 -1.555234
H  3.130107 0.131048 -1.539202
H  3.917653 -1.390897 -0.166105
H  3.972605 1.230471 0.483519
