program: Gaussian 09
title: 000261676
version: EM64L-G09RevD.01
frameworkgroup: C1[X(C11H18O)]
method: RPBEPBE
basis: SDD
operation: Freq
keyword: #pfreq=noraman
keyword: PBEPBE/SDD
title: #p freq=noraman PBEPBE/SDD
converged: YES YES NO NO
title: Mulliken charges:
elementType: O C C C C C C C C C C C H H H H H H H H H H H H H H H H H H
charge: -0.259865 -0.123475 -0.098417 -0.204480 -0.196346 -0.528781 -0.475671 -0.472425 -0.097543 -0.513881 -0.471849 -0.515468 0.238839 0.224572 0.236638 0.238241 0.225204 0.222324 0.226296 0.205644 0.206197 0.225219 0.198025 0.212722 0.223832 0.217377 0.224396 0.207591 0.194905 0.230178
chargesum: 0.00000
title: Mulliken charges with hydrogens summed into heavy atoms:
elementType: O C C C C C C C C C C C
charge: -0.259865 0.115364 0.126155 0.032158 0.041896 -0.081253 -0.043731 -0.041008 0.100482 -0.077328 -0.030076 0.117206
polarizability: 1.22826665e+02 -6.18154363e-01 1.15308973e+02 4.11258473e-01 2.53466475e-01 9.54494533e+01
1716.lowfreq: -19.1989 -7.7432 -0.0006 -0.0001 0.0002 10.4678 80.4662 102.8790 128.6695
frequency: 80.4051 102.8618 128.4853 193.8756 197.7248 246.5683 261.6204 304.6952 372.2129 409.8328 430.1527 473.4567 529.3017 547.4048 653.0655 732.8038 754.6026 791.0216 830.4849 848.6446 871.6948 882.6354 889.5828 916.4577 921.5303 934.1480 958.4263 961.0011 990.0688 998.6849 1030.7250 1035.3624 1044.7515 1054.0852 1068.9349 1107.6852 1115.8165 1118.8006 1121.7964 1136.1686 1153.3698 1172.9328 1176.8706 1193.8695 1207.0800 1219.4382 1254.6553 1259.9652 1265.9427 1271.3397 1282.7512 1284.4610 1289.5796 1293.5433 1306.6211 1318.8080 1323.7055 1351.7953 1434.7233 1457.4852 1463.9628 1466.8916 1471.2009 1477.3207 1479.0848 1490.8035 2905.4997 2922.7854 2983.7025 2990.5606 2995.9055 2997.9884 3003.5183 3004.2244 3005.3796 3014.3609 3041.2694 3046.3656 3054.0876 3057.7600 3067.1873 3073.1016 3075.9810 3094.4218
redmass: 2.8230 2.7289 2.4502 2.0732 1.5067 1.8336 2.0659 3.0110 2.9724 3.8137 3.0983 2.0655 2.8115 2.7171 2.9535 3.5042 2.7428 1.8314 2.1442 2.0855 2.0156 2.7928 2.7510 2.2815 3.0075 2.3806 2.1184 1.6576 1.8710 1.9604 1.4592 1.4808 1.8059 2.5039 2.5060 1.2002 1.8532 1.4242 1.5446 1.3036 1.5332 1.5712 1.6444 1.7709 1.5982 1.3592 1.3440 1.3551 1.3551 1.4413 1.4479 1.4244 1.3488 1.4774 1.4674 1.6326 1.5017 1.3693 1.1406 1.0566 1.0820 1.0876 1.0942 1.0769 1.0671 1.0986 1.0825 1.0357 1.0644 1.0587 1.0904 1.0938 1.0635 1.0602 1.0624 1.0866 1.0933 1.0982 1.0972 1.0930 1.1048 1.1050 1.1038 1.0973
irintensity: 0.2684 4.2226 1.0893 1.7048 0.1677 3.2215 0.7661 1.8289 0.7009 3.8965 3.5756 0.0988 0.6308 3.3630 1.7799 0.2960 2.5831 1.3537 3.2543 3.2173 2.5442 2.9932 8.8177 3.9703 2.4282 5.0640 6.7424 0.7600 1.9052 9.4540 0.0216 1.0285 5.6105 41.2418 56.1280 2.7279 4.7029 2.0309 0.6872 2.6933 1.4102 3.6231 3.4458 2.9981 2.1140 0.6676 2.0133 1.4101 0.3031 0.3433 1.8662 1.0682 1.2722 3.8470 3.6730 3.3980 2.6518 22.4813 4.3015 9.3335 3.3020 2.2979 12.3450 23.5790 9.2483 9.0701 37.3107 74.4775 29.8218 26.0273 34.9460 31.2748 39.9196 75.6938 36.4602 39.7367 67.8979 34.7252 41.2723 17.1195 26.1037 90.2619 54.7852 40.9911
temp: 298.150 k
press: 1.00000 atm
elementType: 8 6 6 6 6 6 6 6 6 6 6 6 1 1 1 1 1 1 1 1 1 1 1 1 1 1 1 1 1 1
symmnumber: 1
zpe: 704300.7 jmol-1
zpe.correction: 0.268254 hartree
zpe.thermalcorrener: 0.278924 hartree
zpe.thermalcorrenthalpy: 0.279868 hartree
zpe.thermalcorrgfe: 0.232385 hartree
zpe.sumelectzpe: -504.218766 hartree
zpe.sumelectthermal: -504.208096 hartree
zpe.sumelectthermalent: -504.207152 hartree
zpe.sumelectthermalfe: -504.254635 hartree
dipole: -1.2982 -0.7813 0.6959
dipole: 1.6674
quadrupole: -78.9482 -70.9691 -73.5136
quadrupole: -2.9994 2.0596 -0.4373
quadrupole: -4.4712 3.5079 0.9633 -2.9994 2.0596 -0.4373
hfenergy: -504.4870202 hartree
pointgroup: C01 [X(C11H18O1)]
dipole: -0.5298341 0.2793894 -0.2674769 debye
polarizability: 122.7174813|1.0897966|115.4023612|-0.4996126|0.5498116|95.4652493 unknown
InChI: InChI=1S/C11H18O/c1-12-10-5-4-9-7-2-3-8(6-7)11(9)10/h7-11H,2-6H2,1H3
charge 0 multiplicity 1
30 atoms
O  2.735453 0.533524 0.299622
C  0.210262 0.250516 0.403143
C  -0.620317 -1.090866 0.555113
C  -0.737499 1.156316 -0.440754
C  -1.943092 -0.772896 -0.206207
C  -1.436011 0.1237 -1.375416
C  -1.926877 1.589858 0.470121
C  -2.75415 0.258191 0.637887
C  1.562511 -0.157158 -0.25646
C  0.268341 -2.210179 -0.068024
C  1.713583 -1.66562 0.025544
C  2.769016 1.957937 -0.022082
H  0.436547 0.70943 1.384987
H  -0.826748 -1.321869 1.616914
H  -0.229334 1.997051 -0.943728
H  -2.516098 -1.670575 -0.494715
H  -0.743929 -0.393197 -2.063906
H  -2.257739 0.56622 -1.967261
H  -2.531638 2.373693 -0.022106
H  -1.578384 1.996721 1.43694
H  -2.840294 -0.055403 1.694224
H  -3.778883 0.373865 0.239805
H  1.522118 0.035832 -1.354954
H  -0.009573 -2.374316 -1.127909
H  0.149391 -3.177921 0.450854
H  2.108445 -1.777739 1.053424
H  2.420166 -2.158513 -0.664308
H  1.941155 2.513728 0.466039
H  2.71129 2.127555 -1.119626
H  3.732388 2.336414 0.356239
