program: Gaussian 09
title: 000026568
version: EM64L-G09RevD.01
frameworkgroup: C1[X(C14H25NO)]
method: RPBEPBE
basis: SDD
operation: Freq
keyword: #p
keyword: freq=noraman
keyword: PBEPBE/SDD
title: #p freq=noraman PBEPBE/SDD
converged: NO YES NO NO
title: Mulliken charges:
elementType: O N C C C C C C C C C C C C C C H H H H H H H H H H H H H H H H H H H H H H H H H
charge: -0.460707 -0.295335 0.480896 -0.110795 -0.105874 -0.098856 -0.542129 -0.541585 -0.533878 -0.450698 -0.450432 -0.451940 -0.503445 -0.409509 -0.345179 -0.326484 0.194412 0.193937 0.192599 0.202997 0.199774 0.193942 0.201284 0.199338 0.196770 0.192283 0.194550 0.192286 0.194893 0.191413 0.195222 0.178002 0.220930 0.226283 0.194400 0.235905 0.222291 0.201433 0.176343 0.209428 0.345235
chargesum: 0.00000
title: Mulliken charges with hydrogens summed into heavy atoms:
elementType: O N C C C C C C C C C C C C C C
charge: -0.115471 -0.059431 0.480896 0.083616 0.088064 0.093743 -0.139359 -0.146359 -0.137770 -0.063865 -0.063253 -0.065304 -0.104514 0.011175 0.078545 0.059288
polarizability: 1.86080833e+02 6.92217500e-01 1.37169188e+02 1.25961207e-01 -3.11715716e-01 1.31606118e+02
1716.lowfreq: -27.9708 -0.0006 0.0003 0.0006 5.8576 17.5981 26.1582 35.6884 59.0412
frequency: 16.6903 34.4850 57.6258 88.3800 103.9501 137.7229 169.6117 199.8631 241.0824 250.1520 269.9589 296.8562 346.5749 354.0820 393.8981 396.3812 411.2397 418.5087 431.3784 463.4915 467.0987 604.4270 640.0074 641.6091 696.9340 707.9067 768.1707 771.6953 802.9302 813.4695 829.3099 866.9266 870.4853 875.7170 911.7937 920.7972 940.9688 958.7753 968.0197 973.3323 983.6319 1008.7779 1018.7067 1031.1093 1047.0228 1049.4188 1058.9194 1065.4271 1099.2399 1100.3041 1104.7561 1107.3735 1112.2037 1120.3065 1139.9782 1145.3432 1161.4025 1181.2825 1193.9549 1210.0883 1226.4213 1254.2194 1262.2736 1272.5350 1282.5918 1286.0270 1292.1353 1298.0318 1304.4421 1308.1256 1312.6572 1315.4702 1325.4986 1334.0457 1341.7293 1346.5825 1355.3792 1357.5820 1365.1560 1381.2684 1419.2019 1446.5580 1451.3729 1454.3545 1456.4826 1461.3514 1465.5462 1467.4734 1477.7599 1483.4230 1488.6693 1497.6523 2862.6948 2891.9975 2929.6445 2936.8572 2949.9337 2952.7179 2957.5197 2959.4099 2960.4516 2960.9613 2988.1416 2988.9382 2998.1521 3001.2941 3001.6495 3006.3495 3012.9850 3013.8251 3019.8790 3021.9567 3023.3096 3024.9008 3037.4685 3412.6288 3576.4165
redmass: 2.6685 2.4597 4.5688 3.5234 1.9571 3.2119 3.0725 4.8669 2.0769 1.0876 2.8910 1.9712 2.5387 2.0757 4.6376 4.6690 2.5274 1.7496 1.7472 3.0484 2.5304 3.5371 3.8636 3.8071 1.4257 3.0321 2.5752 1.5764 2.4870 2.3452 1.1321 1.5929 1.5813 1.5597 3.1664 1.9688 2.2979 2.1476 2.6352 3.7504 2.5991 2.4564 2.0131 2.2449 1.9029 1.7580 1.7240 2.2646 1.5502 1.3861 1.1247 1.1941 1.0334 1.3098 3.0640 4.1826 1.1575 1.2289 1.1567 1.2522 1.3239 1.5275 1.3645 1.2032 1.6604 1.7337 1.8040 1.4266 2.2103 1.6536 1.5951 1.3976 1.3256 1.3732 1.4243 1.4513 1.4653 1.5793 1.5798 1.4205 1.5173 1.0898 1.0820 1.1988 1.0845 1.0917 1.0895 1.0947 1.0737 1.0900 1.0912 1.0805 1.0708 1.0705 1.0614 1.0630 1.0599 1.0603 1.0655 1.0606 1.0609 1.0608 1.0834 1.0835 1.0886 1.0960 1.0833 1.1019 1.1016 1.1019 1.0992 1.1001 1.0990 1.1020 1.0939 1.0737 1.0666
irintensity: 1.0643 1.6528 0.8540 2.2875 10.7891 2.5913 12.1913 0.7006 3.7270 150.2235 6.5303 0.1634 4.6148 0.1756 0.3653 0.0085 1.9831 0.5999 0.2728 6.1449 2.2036 1.7774 0.0100 0.0152 86.6162 11.5754 1.1547 0.2881 2.8145 2.4697 1.6123 0.0898 0.0570 0.0226 0.0537 1.3347 0.8364 8.9067 27.1581 35.3789 12.3216 34.5706 8.8004 11.4652 1.4013 0.0624 2.4486 0.9909 3.4015 6.6621 2.0569 3.0594 0.4182 6.2720 9.6645 49.0258 12.3750 1.4720 2.2603 17.0645 9.6870 3.1469 4.1279 3.8306 1.4608 0.3074 0.2025 2.3528 7.9160 0.4362 2.2148 1.4418 0.0348 2.7514 2.3259 2.3151 3.7950 0.1619 0.5966 1.3821 0.3455 0.2664 0.4978 21.7917 5.5945 18.5597 17.7388 17.2101 0.0993 0.5149 5.9823 2.5526 81.8385 91.7536 68.0544 27.3735 31.3249 25.3581 11.9842 77.5912 43.5527 19.5281 169.4962 154.5840 10.3100 44.4443 49.6859 5.6522 4.8883 3.2912 2.1231 120.4593 93.6835 106.7249 63.8991 2.7747 3.1403
temp: 298.150 k
press: 1.00000 atm
elementType: 8 7 6 6 6 6 6 6 6 6 6 6 6 6 6 6 1 1 1 1 1 1 1 1 1 1 1 1 1 1 1 1 1 1 1 1 1 1 1 1 1
symmnumber: 1
zpe: 970970.9 jmol-1
zpe.correction: 0.369823 hartree
zpe.thermalcorrener: 0.385476 hartree
zpe.thermalcorrenthalpy: 0.386420 hartree
zpe.thermalcorrgfe: 0.325672 hartree
zpe.sumelectzpe: -677.162049 hartree
zpe.sumelectthermal: -677.146396 hartree
zpe.sumelectthermalent: -677.145452 hartree
zpe.sumelectthermalfe: -677.206200 hartree
dipole: 0.1607 -1.3406 0.4276
dipole: 1.4163
quadrupole: -93.3776 -101.4407 -99.5394
quadrupole: 10.3656 0.3029 -2.1036
quadrupole: 4.7416 -3.3215 -1.4201 10.3656 0.3029 -2.1036
hfenergy: -677.5318718 hartree
pointgroup: C01 [X(C14H25N1O1)]
dipole: 0.0721338 0.5149591 -0.2002667 debye
polarizability: 186.0455619|-1.4876753|137.1448912|0.0609409|-0.655106|131.6656854 unknown
InChI: InChI=1S/C14H25NO/c16-4-3-15-2-1-14-8-11-5-12(9-14)7-13(6-11)10-14/h11-13,15-16H,1-10H2
charge 0 multiplicity 1
41 atoms
O  -6.719186 -0.537405 -0.014783
N  -3.167511 0.591892 -0.074388
C  0.737772 0.396975 -0.026202
C  2.464308 -0.981185 1.268667
C  2.518405 -0.963248 -1.267383
C  3.207526 1.10126 0.029738
C  0.995323 -0.477868 1.23863
C  1.04978 -0.458586 -1.2927
C  1.736918 1.595836 0.002807
C  2.741737 -1.833459 -0.000103
C  3.432102 0.231374 1.296938
C  3.486598 0.24883 -1.238214
C  -0.711377 0.95745 -0.050391
C  -1.84937 -0.083062 -0.015402
C  -4.322863 -0.331453 -0.080401
C  -5.630919 0.45202 0.067153
H  2.619942 -1.601544 2.173927
H  2.711988 -1.571383 -2.173686
H  3.889412 1.974858 0.050555
H  0.310976 -1.349739 1.248506
H  0.777587 0.116902 2.150083
H  0.874746 0.152598 -2.202968
H  0.364526 -1.327798 -1.348149
H  1.53255 2.222362 0.895633
H  1.569171 2.236229 -0.888179
H  2.070367 -2.715991 -0.0207
H  3.782652 -2.215108 0.019383
H  3.254721 0.836521 2.209114
H  4.482786 -0.120616 1.336349
H  3.349057 0.866285 -2.149145
H  4.538042 -0.103186 -1.237154
H  -0.826646 1.57731 -0.967688
H  -0.853103 1.642161 0.810387
H  -1.812246 -0.653901 0.932254
H  -1.718408 -0.823645 -0.843463
H  -3.206165 1.247627 -0.869208
H  -4.223799 -1.019471 0.779908
H  -4.388106 -0.966586 -0.997027
H  -5.720265 1.204271 -0.749064
H  -5.632822 0.986801 1.038692
H  -7.586606 -0.087125 0.140276
