program: Gaussian 09
title: 000261683
version: EM64L-G09RevD.01
frameworkgroup: C1[X(C16H20O2)]
method: RPBEPBE
basis: SDD
operation: Freq
keyword: #pfreq=noraman
keyword: PBEPBE/SDD
title: #p freq=noraman PBEPBE/SDD
converged: NO YES NO NO
title: Mulliken charges:
elementType: O O C C C C C C C C C C C C C C C C H H H H H H H H H H H H H H H H H H H H
charge: -0.234890 -0.292077 -0.268719 -0.192030 -0.145600 -0.118246 -0.519828 -0.048666 -0.550317 -0.384246 -0.388396 0.364169 -0.339815 -0.402078 -0.432583 -0.330020 0.438169 -0.809903 0.288181 0.244215 0.226105 0.224590 0.237062 0.275836 0.218838 0.207147 0.262489 0.192998 0.231603 0.230291 0.194620 0.241673 0.247442 0.225316 0.228726 0.228126 0.221985 0.227836
chargesum: 0.00000
title: Mulliken charges with hydrogens summed into heavy atoms:
elementType: O O C C C C C C C C C C C C C C C C
charge: -0.234890 -0.292077 0.019462 0.052185 0.080504 0.106343 -0.006931 0.170172 -0.080680 0.040355 0.036515 0.364169 -0.098143 -0.154635 -0.207268 -0.101294 0.438169 -0.131957
polarizability: 2.32114189e+02 -1.29203998e+01 1.58559626e+02 -1.17398400e+01 -1.18853180e+01 1.21254949e+02
1716.lowfreq: -11.0441 -0.0005 -0.0003 0.0001 2.3201 17.5469 30.5094 41.8600 51.7555
frequency: 29.3584 41.6811 51.6702 61.9401 96.9277 138.6318 170.3957 193.3981 228.5753 240.4483 269.0416 329.1342 334.5020 353.4811 388.5005 415.4850 457.0562 484.2832 509.7395 535.1291 566.5617 635.9797 680.8357 711.0388 712.7978 727.8218 755.4251 787.1526 800.2593 810.4615 816.6855 828.7929 841.3533 858.4886 875.5490 901.4737 911.6976 923.9017 933.0623 940.2130 961.4341 972.0717 978.2438 984.1921 989.3770 1005.2162 1006.1401 1028.5736 1046.5024 1051.2586 1059.2935 1077.9878 1098.6323 1119.8668 1123.2570 1133.0771 1145.3830 1171.9682 1175.6295 1196.7824 1201.0511 1213.7333 1219.7990 1223.5887 1250.6840 1252.0475 1267.0642 1275.0812 1283.6514 1296.3671 1304.0378 1305.2617 1327.0577 1331.4467 1341.0136 1352.4081 1370.3773 1400.4578 1414.6549 1458.4139 1466.4912 1471.0710 1474.5951 1478.0435 1479.9975 1499.4089 1583.8024 1625.5564 2943.0629 2949.3304 2972.5823 2986.0501 3009.7962 3016.0847 3030.1627 3032.2174 3048.7799 3060.2263 3064.8634 3066.3790 3078.0660 3080.0197 3082.0218 3105.4606 3120.6388 3123.2214 3160.2360 3163.9894
redmass: 3.2094 1.1538 3.5948 3.4415 3.5108 3.5410 4.9097 4.2315 4.0138 3.4953 2.1366 3.6488 2.9241 3.1129 2.7348 2.9705 3.4305 2.6386 2.5192 4.7274 3.2217 6.5064 5.0581 3.2086 3.4148 4.4921 4.3299 3.8911 3.8358 1.4523 3.9253 1.3399 3.0386 3.5934 2.9984 2.5094 2.2684 2.0919 1.4862 2.4564 1.3501 2.9761 1.8623 1.6843 1.8365 2.5493 1.8222 2.2753 1.5234 1.4022 1.5177 3.0274 1.6137 1.2051 1.1909 1.5820 1.3755 1.3337 1.4450 1.5807 1.6289 2.1066 1.2666 4.2950 1.3312 1.4177 1.5620 1.3529 1.3462 1.5016 1.3155 1.3099 1.5538 1.5563 1.3143 1.3279 4.3807 1.2432 3.6151 1.0843 1.0835 1.0459 1.0894 1.0970 1.0995 2.6480 6.4023 6.4614 1.0672 1.0686 1.0373 1.0847 1.0846 1.0624 1.0615 1.0861 1.0978 1.0922 1.0923 1.0975 1.0915 1.0983 1.1036 1.1062 1.0893 1.0890 1.0943 1.0945
irintensity: 0.4970 0.2192 0.3265 0.3440 0.8776 0.6086 3.0791 8.1819 0.2354 7.8048 1.3190 3.1529 0.4909 4.5872 0.5032 0.0050 0.3962 1.0311 18.2108 2.2317 0.9563 0.5750 11.6734 0.5813 1.9012 6.2213 1.8401 0.0699 0.8355 49.2426 4.2367 22.2677 1.3433 16.4890 21.6072 13.0575 1.8456 10.1724 2.6510 16.0217 0.6249 31.4934 5.0389 27.1155 14.7053 11.3693 15.6836 7.5688 10.9025 2.0894 20.9920 47.1040 2.1246 11.1655 8.2505 1.2576 1.5499 8.2258 98.4958 3.0969 1.0790 176.3709 1.4083 35.6489 3.1440 2.3971 4.7458 0.6881 2.9531 7.2120 0.7040 3.7124 2.7182 2.3831 22.8659 3.6526 8.5018 9.3567 3.9105 15.6583 4.2177 12.0694 4.2185 13.5709 15.6223 170.4777 12.9372 37.3846 59.2732 115.2537 52.6088 19.4033 32.5064 30.9227 37.2260 48.9820 24.5186 8.5454 81.4520 27.2037 8.6969 19.7680 25.9328 13.3220 17.2645 26.9985 19.5048 6.6366
temp: 298.150 k
press: 1.00000 atm
elementType: 8 8 6 6 6 6 6 6 6 6 6 6 6 6 6 6 6 6 1 1 1 1 1 1 1 1 1 1 1 1 1 1 1 1 1 1 1 1
symmnumber: 1
zpe: 848954.9 jmol-1
zpe.correction: 0.323350 hartree
zpe.thermalcorrener: 0.338791 hartree
zpe.thermalcorrenthalpy: 0.339735 hartree
zpe.thermalcorrgfe: 0.279343 hartree
zpe.sumelectzpe: -770.782761 hartree
zpe.sumelectthermal: -770.767320 hartree
zpe.sumelectthermalent: -770.766376 hartree
zpe.sumelectthermalfe: -770.826769 hartree
dipole: -0.0998 0.2047 -2.0257
dipole: 2.0385
quadrupole: -104.4532 -105.7026 -108.9212
quadrupole: -8.2099 -9.8365 -5.4246
quadrupole: 1.9058 0.6564 -2.5622 -8.2099 -9.8365 -5.4246
hfenergy: -771.1061112 hartree
pointgroup: C01 [X(C16H20O2)]
dipole: -0.0368966 0.2340161 -0.7662112 debye
polarizability: 231.7100268|-11.5363316|162.0304845|-14.2858502|-3.6561435|118.1882535 unknown
InChI: InChI=1S/C16H20O2/c1-10-2-4-12(5-3-10)18-16-7-11-6-13(16)15-9-17-8-14(11)15/h2-5,11,13-16H,6-9H2,1H3
charge 0 multiplicity 1
38 atoms
O  4.182369 1.200023 1.055897
O  -0.744866 -1.395672 -0.413176
C  1.161157 0.134039 0.217128
C  2.700466 -1.47682 -0.259056
C  2.308625 0.940273 -0.468417
C  3.39197 -0.180176 -0.783665
C  1.93463 -0.96808 0.99602
C  0.469597 -0.702336 -0.901377
C  1.520714 -1.809872 -1.221007
C  3.050278 1.937559 0.4573
C  4.647669 0.270688 0.004232
C  -1.931489 -0.653868 -0.265395
C  -2.078606 0.721501 -0.569413
C  -3.045796 -1.387368 0.214702
C  -3.339564 1.341453 -0.396334
C  -4.288451 -0.750435 0.383931
C  -4.463915 0.628252 0.081145
C  -5.812748 1.302347 0.268966
H  0.463051 0.756191 0.798967
H  3.395753 -2.318263 -0.104647
H  1.949334 1.453989 -1.379835
H  3.619495 -0.263256 -1.861937
H  1.260031 -1.72916 1.424904
H  2.592815 -0.562286 1.780539
H  0.199202 -0.0912 -1.785509
H  1.820708 -1.815934 -2.283701
H  1.076249 -2.791593 -0.981916
H  3.43174 2.802663 -0.126878
H  2.438373 2.308101 1.297245
H  5.166523 -0.553557 0.522897
H  5.366212 0.790975 -0.664798
H  -1.237077 1.316497 -0.935776
H  -2.913618 -2.449435 0.444017
H  -3.442143 2.406588 -0.638026
H  -5.140227 -1.332959 0.756804
H  -6.148346 1.250708 1.322261
H  -5.774436 2.36772 -0.017279
H  -6.596177 0.818597 -0.344906
