program: Gaussian 09
title: 000261709
version: EM64L-G09RevD.01
frameworkgroup: C1[X(C16H18N6O4)]
method: RPBEPBE
basis: SDD
operation: Freq
keyword: #p
keyword: freq=noraman
keyword: PBEPBE/SDD
title: #p freq=noraman PBEPBE/SDD
converged: YES YES NO NO
title: Mulliken charges:
elementType: O O O O N N N N N N C C C C C C C C C C C C C C C C H H H H H H H H H H H H H H H H H H
charge: -0.463161 -0.446582 -0.212612 -0.196099 -0.118524 -0.261921 -0.067065 -0.082057 -0.071538 0.017603 0.195779 -0.093642 -0.412807 -0.372316 0.129277 0.488884 -0.249799 -0.307891 -0.335489 -0.532595 -0.357292 0.217699 0.397596 -0.401083 -0.394486 -0.775147 0.255658 0.260176 0.237108 0.271657 0.268548 0.227948 0.202772 0.228622 0.222028 0.280750 0.334051 0.244833 0.246694 0.255840 0.217763 0.253890 0.351904 0.345025
chargesum: 0.00000
title: Mulliken charges with hydrogens summed into heavy atoms:
elementType: O O O O N N N N N N C C C C C C C C C C C C C C C C
charge: -0.111257 -0.101557 -0.212612 -0.196099 -0.118524 -0.261921 -0.067065 -0.082057 -0.071538 0.017603 0.195779 -0.093642 0.103027 0.136449 0.129277 0.488884 0.018749 0.122828 0.115161 -0.251845 -0.023241 0.217699 0.397596 -0.156250 -0.147792 -0.047654
polarizability: 4.05705041e+02 1.10950472e-01 2.39120490e+02 3.25622424e+00 2.11861750e+01 1.25311887e+02
1716.lowfreq: -4.3920 -2.6987 -0.0003 0.0005 0.0008 3.8760 6.2843 21.8129 27.6997
frequency: 4.9638 21.7091 27.6750 41.2756 49.4121 57.0642 62.5128 94.3698 97.9179 105.5964 132.2953 146.0242 173.5552 178.7621 196.6872 223.3320 229.9733 246.6725 263.5858 271.9200 290.3605 302.9189 309.2829 341.7110 365.4158 374.1944 385.2585 391.7891 419.4816 426.6094 440.0697 518.6666 524.6242 535.8520 550.3718 570.9900 577.6817 610.9413 638.1637 650.9335 668.6579 678.2506 690.8523 697.4720 720.7076 763.4637 779.0510 798.1306 803.2323 834.1492 846.5926 853.7996 860.8450 879.1332 902.3919 919.0119 931.8628 956.3720 979.9415 1005.8773 1015.6226 1025.2112 1030.5962 1042.7119 1052.6027 1054.0844 1059.3882 1096.0367 1105.4844 1144.2405 1160.5472 1179.8598 1181.3306 1200.2056 1205.9652 1220.2872 1228.2874 1249.1253 1261.0513 1274.0735 1284.4557 1302.4474 1314.3858 1325.3956 1339.4271 1346.2038 1360.5748 1361.2398 1368.9323 1372.6592 1375.8843 1393.8631 1400.4681 1407.7663 1427.7194 1430.3011 1450.4323 1454.7493 1456.9136 1465.4877 1468.4699 1470.9310 1488.4310 1508.3411 1516.3251 1567.7073 1584.6062 1631.3461 2958.0010 2995.6861 2997.2449 3021.6155 3036.4652 3039.9885 3079.7706 3083.4782 3097.4447 3100.5411 3111.6127 3142.4579 3156.7371 3158.6662 3187.0344 3253.7775 3564.0315 3580.8482
redmass: 6.3784 8.1933 7.0425 6.0630 5.8956 5.4275 6.1133 4.1244 4.1284 4.1826 3.1664 4.3881 7.0912 5.8650 4.7606 3.1804 1.0982 2.8299 1.3351 5.6142 4.9109 1.3227 3.6423 4.4922 4.3381 3.5380 4.2022 2.6222 5.6021 3.4480 3.4954 3.3408 3.6513 3.5338 3.5130 4.4073 5.9686 4.1575 4.0692 6.9830 8.2690 7.1848 3.5510 8.2946 5.8938 6.6452 3.1765 4.2991 2.3621 5.3067 2.5346 4.9292 1.2901 3.2235 2.5060 1.5239 1.4359 2.2724 4.0122 1.5050 1.3319 2.9552 3.3672 1.5517 1.9518 2.0888 3.5264 5.4647 2.2254 4.1528 1.7450 1.5592 1.5061 6.5458 1.1501 2.8585 1.7352 1.8146 2.0640 1.9781 2.0351 2.3711 1.4270 1.2587 5.3547 1.3214 1.2374 4.1572 3.8541 1.6763 2.5354 1.6047 1.4043 1.2770 2.4441 4.0169 1.8662 1.0468 1.2153 1.0925 1.1536 1.0915 2.1146 3.3236 7.9439 7.7184 6.0197 6.7228 1.0589 1.0364 1.0627 1.0899 1.0625 1.0723 1.0959 1.1018 1.1014 1.1044 1.1040 1.0901 1.0962 1.0932 1.0912 1.0975 1.0662 1.0666
irintensity: 2.9522 0.1062 0.1327 0.4664 3.3101 1.1327 1.1980 8.4462 3.2865 2.5515 8.3271 0.5345 2.1938 2.0239 11.2492 18.1136 1.3236 34.5560 106.1107 1.3871 7.0606 157.5992 17.6274 12.7277 4.3600 1.7714 3.5632 20.7803 2.9888 0.4750 22.4135 2.1131 2.5665 0.6515 17.6207 6.6756 6.3797 2.9109 14.4655 13.1735 5.6646 1.4450 0.1276 44.2296 5.5914 6.2815 19.8478 14.9171 4.8859 5.9930 24.7542 8.9324 22.5495 10.2561 13.0880 30.9836 11.5140 23.9425 114.7555 6.3509 5.3359 33.6524 103.2628 7.9325 11.8223 2.2863 22.0989 13.4453 10.1774 22.1574 45.5440 74.4528 9.4526 327.1679 20.8981 11.6856 49.1594 14.3106 1.9908 158.1304 46.7265 41.8126 47.8813 4.2894 181.2372 6.1373 1.5979 27.5560 100.1602 135.1281 9.3045 1.9439 0.7858 20.2650 65.3815 5.3548 21.4306 14.0533 16.6843 11.0584 17.9345 8.3002 35.4258 459.0991 85.2774 0.6277 701.7825 20.1016 46.3588 14.4999 33.5604 14.1275 16.9679 64.1615 6.5919 45.9173 24.2293 0.8527 5.5557 22.3523 34.5883 23.4625 10.1425 2.3813 8.4140 4.5484
temp: 298.150 k
press: 1.00000 atm
elementType: 8 8 8 8 7 7 7 7 7 7 6 6 6 6 6 6 6 6 6 6 6 6 6 6 6 6 1 1 1 1 1 1 1 1 1 1 1 1 1 1 1 1 1 1
symmnumber: 1
zpe: 883131.1 jmol-1
zpe.correction: 0.336367 hartree
zpe.thermalcorrener: 0.360516 hartree
zpe.thermalcorrenthalpy: 0.361460 hartree
zpe.thermalcorrgfe: 0.278608 hartree
zpe.sumelectzpe: -1247.912082 hartree
zpe.sumelectthermal: -1247.887933 hartree
zpe.sumelectthermalent: -1247.886989 hartree
zpe.sumelectthermalfe: -1247.969840 hartree
dipole: -0.2545 -1.1897 -2.5403
dipole: 2.8166
quadrupole: -183.7412 -147.7702 -150.2025
quadrupole: -25.8933 5.9465 -4.6646
quadrupole: -23.1699 12.8011 10.3688 -25.8933 5.9465 -4.6646
hfenergy: -1248.2484489 hartree
pointgroup: C01 [X(C16H18N6O4)]
dipole: 0.1305944 0.9146843 -0.6117698 debye
polarizability: 405.6000942|-1.6923962|227.6145331|6.1360723|40.3020035|136.9227913 unknown
InChI: InChI=1S/C16H18N6O4/c1-11-2-3-12(8-13(11)22(25)26)21-10-19-14-15(17-9-18-16(14)21)20(4-6-23)5-7-24/h2-3,8-10,23-24H,4-7H2,1H3
charge 0 multiplicity 1
44 atoms
O  5.353559 -1.098673 -2.562188
O  5.864733 -0.892921 2.214598
O  -4.971747 -2.620292 -0.998079
O  -6.718794 -1.238607 -0.550978
N  4.011003 -0.245699 -0.044643
N  -0.746759 -0.140401 -0.220217
N  1.106445 -1.428236 -0.660209
N  2.842899 1.69681 0.603878
N  0.40188 1.923049 0.597641
N  -5.4528 -1.473387 -0.640443
C  2.809624 0.396123 0.123289
C  1.51663 -0.174248 -0.151534
C  4.100515 -1.631254 -0.565234
C  5.28507 0.483341 0.200301
C  0.380561 0.644458 0.119153
C  -2.132128 0.215293 -0.123321
C  -0.22882 -1.370778 -0.68384
C  4.098936 -1.713896 -2.095994
C  5.687022 0.47214 1.68796
C  -3.129236 -0.737987 -0.405854
C  -2.522236 1.526675 0.258093
C  -4.49294 -0.38106 -0.318481
C  -4.929871 0.924497 0.054414
C  -3.888219 1.84841 0.336806
C  1.678827 2.366455 0.80384
C  -6.368137 1.384726 0.167556
H  3.248742 -2.222806 -0.19354
H  5.039298 -2.069052 -0.184606
H  5.171574 1.529714 -0.131078
H  6.054358 -0.006627 -0.416986
H  -0.862998 -2.178766 -1.035192
H  3.210696 -1.192162 -2.503073
H  4.04814 -2.784235 -2.388663
H  4.944445 1.03859 2.28273
H  6.675811 0.948268 1.799411
H  -2.905354 -1.767869 -0.690624
H  -1.749419 2.263851 0.49329
H  -4.168008 2.865598 0.630991
H  1.775199 3.3897 1.179469
H  -6.929125 0.794083 0.91225
H  -6.398022 2.448327 0.458059
H  -6.915453 1.257484 -0.782463
H  5.364685 -1.066804 -3.550619
H  4.971617 -1.309635 2.313531
