program: Gaussian 09
title: 000261663
version: EM64L-G09RevD.01
frameworkgroup: C1[X(C15H22O2)]
method: RPBEPBE
basis: SDD
operation: Freq
keyword: #pfreq=noraman
keyword: PBEPBE/SDD
title: #p freq=noraman PBEPBE/SDD
converged: YES YES NO NO
title: Mulliken charges:
elementType: O O C C C C C C C C C C C C C C C H H H H H H H H H H H H H H H H H H H H H H
charge: -0.443987 -0.238018 0.009392 -0.118509 -0.511975 -0.206412 -0.156591 -0.467066 -0.516319 -0.512929 -0.441357 -0.626855 0.526097 -0.446774 -0.530669 -0.570957 0.184529 0.211492 0.219901 0.249176 0.201883 0.234378 0.255741 0.210928 0.223414 0.190007 0.237377 0.229617 0.232299 0.226389 0.213672 0.233855 0.219749 0.214866 0.211235 0.225627 0.243668 0.255606 0.327518
chargesum: 0.00000
title: Mulliken charges with hydrogens summed into heavy atoms:
elementType: O O C C C C C C C C C C C C C C C
charge: -0.116469 -0.238018 0.220884 0.101391 -0.060916 0.027966 0.099151 -0.032724 -0.088934 -0.051013 -0.001295 -0.173251 0.526097 -0.020673 -0.061374 -0.315351 0.184529
polarizability: 2.21755937e+02 3.71456863e+00 1.47591288e+02 6.22348954e+00 1.69967713e+00 1.19249992e+02
1716.lowfreq: -12.0715 -0.0006 0.0001 0.0004 4.7349 15.3043 25.8276 35.1332 36.7260
frequency: 25.6148 35.0480 36.5531 86.1111 96.1247 118.3207 147.9299 180.8750 209.5470 226.7582 253.7914 272.0441 275.8108 322.3002 359.9252 389.8542 421.6794 436.8371 448.3920 461.3858 502.1020 527.7826 572.4476 609.5341 636.5664 680.8792 715.6954 735.8906 757.2530 778.2224 802.8925 843.5085 855.8823 863.4856 882.0427 892.5972 902.5790 916.2243 935.7253 965.3923 981.2661 993.3981 1003.3298 1017.5569 1051.3038 1061.3924 1070.6179 1081.5764 1101.2128 1109.6157 1115.6426 1118.2194 1135.2458 1150.6965 1167.4509 1184.4063 1195.7632 1202.5876 1212.7790 1221.8707 1233.0482 1244.5415 1262.6328 1264.8384 1268.7181 1279.6336 1287.7751 1296.4729 1305.4100 1307.5603 1313.2567 1318.4644 1325.0148 1334.1828 1342.6552 1346.8922 1360.2496 1372.6175 1374.3290 1443.0332 1450.3281 1458.7143 1462.0091 1468.5258 1473.9320 1475.5892 1487.2004 1584.7502 1628.8662 2914.3193 2941.7736 2942.8367 2950.9416 2959.8285 2964.8271 2970.8352 2974.8511 2979.6732 2999.2828 3014.0783 3035.3287 3037.9292 3039.7402 3045.8503 3048.5115 3061.9608 3065.3063 3071.6390 3081.6864 3119.6105 3549.3189
redmass: 2.1913 4.3546 3.6186 3.3639 4.2692 2.6009 3.3068 3.2884 2.2679 4.3757 2.7070 2.1271 1.3907 2.3886 2.9517 2.5977 3.0274 3.5197 3.5622 4.0596 3.2697 2.4819 2.7012 2.5651 3.0837 2.9777 3.3729 2.6068 1.4876 2.0261 3.1074 1.9147 2.4846 1.7672 1.8155 2.3731 2.1778 1.5581 2.1813 1.7221 1.9747 2.0159 2.3638 2.0046 2.8185 2.4221 1.8103 2.1943 1.7312 1.4953 1.7296 1.6788 1.8950 1.8516 1.3526 1.6226 1.4194 1.5046 1.3043 1.4271 1.3204 1.4428 1.3226 1.3303 1.5584 1.3624 1.3385 1.3191 1.3805 1.4138 1.3815 1.4572 1.5332 1.4720 1.5696 1.5403 1.9667 1.6785 1.1662 1.0828 1.0889 1.0896 1.0765 1.0901 1.0836 1.0838 1.0943 9.9157 7.8353 1.0799 1.0682 1.0777 1.0752 1.0670 1.0701 1.0671 1.0657 1.0607 1.0606 1.0640 1.0930 1.0987 1.1008 1.0987 1.0985 1.0980 1.0951 1.0921 1.1003 1.0914 1.0659
irintensity: 0.5795 3.1129 1.3651 1.8052 0.2628 0.3920 0.2035 5.4419 0.3720 0.8944 1.3338 39.9259 114.7702 2.5883 5.1934 3.7040 9.7542 3.0391 4.7036 2.6639 1.3019 1.7245 2.0419 5.1934 1.0319 3.8666 5.5254 3.6755 1.5968 2.7423 29.6232 5.0322 5.2718 4.0826 7.0399 19.0321 7.2145 17.5655 20.0896 8.9581 13.4376 7.6003 2.2130 0.7678 3.0224 5.7927 3.7992 6.1819 3.0019 26.4269 16.0137 9.1679 12.1189 9.1003 5.2745 0.6755 7.0863 44.2600 5.1150 1.7556 0.4818 3.2168 30.1720 10.7608 22.0653 1.4391 2.8540 1.2729 1.0716 0.0947 1.5957 13.3467 7.9535 0.7029 0.7136 6.0304 4.0948 2.6509 23.6798 14.0763 14.5902 0.6932 5.3625 9.2578 1.5498 19.5001 6.3386 176.3822 178.4332 8.4788 17.6730 2.0748 5.8695 1.3258 43.4369 16.4169 54.7091 65.9134 26.6571 57.6394 32.2604 21.5437 20.2586 61.1298 24.7112 14.6360 22.3718 18.9457 71.3883 10.6878 3.5611
temp: 298.150 k
press: 1.00000 atm
elementType: 8 8 6 6 6 6 6 6 6 6 6 6 6 6 6 6 6 1 1 1 1 1 1 1 1 1 1 1 1 1 1 1 1 1 1 1 1 1 1
symmnumber: 1
zpe: 890613.2 jmol-1
zpe.correction: 0.339217 hartree
zpe.thermalcorrener: 0.355450 hartree
zpe.thermalcorrenthalpy: 0.356394 hartree
zpe.thermalcorrgfe: 0.294259 hartree
zpe.sumelectzpe: -733.919466 hartree
zpe.sumelectthermal: -733.903233 hartree
zpe.sumelectthermalent: -733.902289 hartree
zpe.sumelectthermalfe: -733.964424 hartree
dipole: 6.2225 0.9622 0.5507
dipole: 6.3205
quadrupole: -133.8690 -102.8795 -100.3381
quadrupole: 8.7668 -6.3041 3.7024
quadrupole: -21.5068 9.4827 12.0241 8.7668 -6.3041 3.7024
hfenergy: -734.2586831 hartree
pointgroup: C01 [X(C15H22O2)]
dipole: 2.446081 0.397803 0.2047256 debye
polarizability: 221.74483|4.302472|147.6682453|5.7772622|1.5757693|119.1841422 unknown
InChI: InChI=1S/C15H22O2/c16-13-7-6-10-8-12(5-4-11(10)9-13)14-2-1-3-15(14)17/h9-10,12,14-15,17H,1-8H2
charge 0 multiplicity 1
39 atoms
O  3.010747 -1.565325 1.230387
O  -5.458858 0.172306 -0.456405
C  1.034226 0.385137 0.22272
C  2.429418 0.239243 -0.432424
C  0.065365 -0.725202 -0.250889
C  -1.353761 -0.637225 0.382927
C  3.140002 -1.124319 -0.178635
C  0.404451 1.771076 -0.062392
C  3.497442 1.271917 0.028808
C  4.618025 -0.870275 -0.577105
C  4.859741 0.671428 -0.431097
C  -0.982015 1.912387 0.615467
C  -1.929856 0.772874 0.289587
C  -2.294252 -1.689717 -0.25436
C  -3.767725 -1.4941 0.157904
C  -3.248348 1.002699 -0.012272
C  -4.251105 -0.0748 -0.152366
H  1.163587 0.278247 1.322121
H  2.311779 0.336581 -1.534666
H  0.486563 -1.719128 -0.012615
H  -0.034966 -0.664186 -1.355785
H  -1.23987 -0.86913 1.46764
H  2.688411 -1.957963 -0.73952
H  0.296498 1.904913 -1.15872
H  1.065024 2.581129 0.299971
H  3.462108 1.378246 1.134016
H  3.325723 2.278276 -0.390132
H  4.787298 -1.19084 -1.62134
H  5.28749 -1.477992 0.057068
H  5.157206 1.106253 -1.402388
H  5.670351 0.902391 0.28269
H  -1.448319 2.881801 0.360264
H  -0.822009 1.91736 1.716524
H  -1.951354 -2.705961 0.018433
H  -2.215807 -1.609221 -1.357524
H  -3.880555 -1.654861 1.2509
H  -4.43848 -2.213467 -0.343698
H  -3.632533 2.0268 -0.108593
H  3.449758 -0.893651 1.812501
