program: Gaussian 09
title: 000261629
version: EM64L-G09RevD.01
frameworkgroup: C1[X(C8H7N3O2)]
method: RPBEPBE
basis: SDD
operation: Freq
keyword: #pfreq=noraman
keyword: PBEPBE/SDD
title: #p freq=noraman PBEPBE/SDD
converged: NO YES NO NO
title: Mulliken charges:
elementType: O O N N N C C C C C C C C H H H H H H H
charge: -0.396928 -0.334888 -0.371393 -0.321658 0.023093 0.171499 0.273648 0.210880 -0.065316 -0.377206 -0.389999 -0.233052 -0.213203 0.357519 0.226323 0.270384 0.230703 0.232012 0.324948 0.382634
chargesum: 0.00000
title: Mulliken charges with hydrogens summed into heavy atoms:
elementType: O O N N N C C C C C C C C
charge: -0.014295 -0.334888 -0.013874 0.003290 0.023093 0.171499 0.273648 0.210880 -0.065316 -0.150883 -0.119615 -0.002349 0.018810
polarizability: 1.79057161e+02 1.68149548e+01 1.65707928e+02 2.63481307e+00 -2.71521567e+00 4.79690850e+01
1716.lowfreq: -0.0011 -0.0003 0.0007 2.4834 4.6593 9.0569 76.7195 109.2132 124.6332
frequency: 76.6933 109.2127 124.6301 155.2611 179.7489 222.0494 267.1601 296.5177 377.8901 397.3106 416.0384 449.8151 516.1415 577.9248 588.6747 606.2128 650.8515 663.5971 705.4678 758.7905 763.6799 779.9808 796.3913 840.8657 869.0583 946.6713 952.5720 993.3708 1007.6446 1031.5143 1099.6417 1129.4506 1170.2631 1180.4479 1213.3818 1236.1750 1308.8159 1312.9366 1342.5255 1389.4053 1424.6986 1441.8051 1466.1823 1505.4524 1565.7139 1570.7626 1632.0744 3124.9999 3140.4205 3160.8043 3174.9372 3449.6049 3512.3450 3513.7263
redmass: 5.1462 6.0899 7.4421 5.4488 4.3068 5.0863 6.6478 7.7937 2.3810 2.0634 2.9913 4.1452 5.4540 7.4030 3.3587 3.4475 5.0369 5.8099 2.9881 2.1177 1.9751 4.4728 1.2663 3.1952 1.4489 3.4187 1.3756 1.3321 2.2002 5.2596 3.7525 1.7017 1.7501 1.2686 5.2387 2.2747 1.9405 1.2615 1.8924 2.2944 3.9006 2.4872 3.3548 3.9616 7.3240 6.4809 7.5306 1.0878 1.0891 1.0952 1.0990 1.0776 1.0726 1.0746
irintensity: 1.1786 0.6719 2.1212 9.6892 4.5170 2.3140 5.5375 11.7913 23.1780 44.9732 5.0845 13.9613 14.2987 10.4744 63.6799 147.7325 19.8525 55.3559 128.3840 69.9168 44.5884 6.9630 73.1158 14.5730 1.2230 62.9650 0.7605 0.2993 7.3856 2.8485 42.1571 3.2294 18.8100 0.8459 334.6386 34.2272 28.3624 77.2909 29.8403 5.9118 25.8156 33.7435 66.8893 30.8165 175.1014 3.7874 37.3897 2.8451 11.9927 18.5755 15.0691 17.3498 32.4482 126.1523
temp: 298.150 k
press: 1.00000 atm
elementType: 8 8 7 7 7 6 6 6 6 6 6 6 6 1 1 1 1 1 1 1
symmnumber: 1
zpe: 377950.0 jmol-1
zpe.correction: 0.143954 hartree
zpe.thermalcorrener: 0.154751 hartree
zpe.thermalcorrenthalpy: 0.155695 hartree
zpe.thermalcorrgfe: 0.107274 hartree
zpe.sumelectzpe: -622.720198 hartree
zpe.sumelectthermal: -622.709400 hartree
zpe.sumelectthermalent: -622.708456 hartree
zpe.sumelectthermalfe: -622.756877 hartree
dipole: -1.2899 -7.9817 0.7676
dipole: 8.1216
quadrupole: -63.7343 -78.5252 -78.1739
quadrupole: -14.7640 4.7284 -1.3892
quadrupole: 9.7435 -5.0474 -4.6961 -14.7640 4.7284 -1.3892
hfenergy: -622.8641512 hartree
pointgroup: C01 [X(C8H7N3O2)]
dipole: 0.7899354 -3.0788069 -0.3267887 debye
dipolederiv: -0.588521 -0.4231361 -0.0242373 -0.1189777 -0.4546845 0.1191344 0.2254589 0.442649 -0.0029938 -1.1790303 1.1249936 0.0198437 -0.0354122 -0.3818455 -0.0047226 -0.0211727 0.0300781 -0.2459105 -0.6884235 0.212301 -0.0154783 -0.0226699 -0.0880787 -0.0177284 -0.0910114 -0.0517479 -0.1605784 0.1623518 -0.0912515 -0.0107784 -0.2261021 -0.9957121 -0.2039155 -0.3294643 -0.9558978 -0.3151586 0.8216314 -1.2206951 -0.0238605 -0.616516 0.8483898 0.0230324 -0.000059 0.0052276 -0.1912269 -0.097168 -0.6314436 -0.0447041 0.1293424 -0.3379059 0.001759 0.034889 0.0349022 -0.043318 0.5308862 -0.3543285 0.0026555 -0.2399165 0.1534002 -0.0018833 -0.0083261 -0.0222977 0.0429547 0.5932857 0.7832442 0.1066353 0.3974542 1.0577113 0.1019503 0.1163336 0.275631 0.1465834 -0.1952202 0.2837966 0.0110445 0.7438226 -0.8559094 -0.0043122 0.0361661 -0.0101862 0.024502 0.1067249 0.2727379 0.0262824 -0.1275424 0.045676 0.0050871 0.004223 0.0191425 -0.1472544 -0.2906729 0.1952303 0.0021831 0.0355571 0.1020062 0.0084878 -0.0021773 0.012898 -0.1337005 -0.0175719 -0.2392437 -0.005857 -0.0275212 -0.1799388 -0.0050087 0.0038436 -0.0039502 -0.1735761 0.1500363 0.0295192 0.0100946 -0.0608062 0.239093 0.0131288 0.0072836 0.012504 -0.144445 0.2878165 -0.0608645 -0.0040226 0.1013648 0.2064261 0.0001762 0.0067755 -0.0128578 0.3127549 0.0833213 -0.0464932 -0.0047182 0.0170903 -0.1067855 -0.0077926 -0.0030739 -0.0153795 0.1585228 0.0786984 0.0250066 -0.0014206 -0.0333038 -0.0254642 -0.0058763 -0.0043889 -0.0070574 0.1633727 -0.0736545 0.0940984 -0.0051558 0.0983091 0.0279934 -0.0013758 -0.0028963 0.0004632 0.1660277 -0.0856152 -0.0849725 -0.0104615 -0.0861575 0.0529505 -0.006001 -0.0107727 -0.0072776 0.157476 0.0777512 0.0348171 -0.0179935 0.0218726 0.2995753 0.061333 0.0384434 0.2849776 0.265821 0.3233738 0.0966839 -0.0100513 0.0501125 0.3931028 -0.0754728 -0.0000744 -0.0318211 0.1201469 unknown
polarizability: 181.8584895|-15.4415079|162.7441233|3.9574634|4.0448654|48.1315619 unknown
InChI: InChI=1S/C8H7N3O2/c12-10-7-5-3-1-2-4-6(5)8(9-7)11-13/h1-4,9-10,12H
charge 0 multiplicity 1
20 atoms
O  -2.753878 -2.467011 0.173743
O  -2.557587 2.508059 -0.034302
N  -1.551773 0.027505 -0.114297
N  -1.350253 -2.387199 -0.264285
N  -1.230089 2.459095 -0.008098
C  0.588418 -0.744806 -0.061289
C  0.6314 0.704874 -0.018711
C  -0.806047 -1.110708 -0.115661
C  -0.724531 1.17741 -0.049212
C  1.784356 -1.513472 -0.047557
C  1.881363 1.375047 0.041713
C  3.00838 -0.830287 0.017026
C  3.052661 0.601179 0.061232
H  -2.571536 0.133573 -0.092695
H  1.765896 -2.608658 -0.093221
H  1.916587 2.467803 0.071886
H  3.946914 -1.394383 0.030955
H  4.027807 1.098276 0.109102
H  -0.813972 -3.151239 0.169501
H  -3.234019 -2.780361 -0.640334
