program: Gaussian 09
title: 000261652
version: EM64L-G09RevD.01
frameworkgroup: C1[X(C18H23FO2)]
method: RPBEPBE
basis: SDD
operation: Freq
keyword: #p
keyword: freq=noraman
keyword: PBEPBE/SDD
title: #p freq=noraman PBEPBE/SDD
converged: YES YES NO NO
title: Mulliken charges:
elementType: F O O C C C C C C C C C C C C C C C C C C H H H H H H H H H H H H H H H H H H H H H H H
charge: -0.223936 -0.441614 -0.426072 0.323018 -0.200429 -0.075326 -0.225209 -0.157560 -0.464743 -0.485280 -0.515638 -0.496822 -0.499299 -0.769532 0.403617 -0.552063 0.160434 -0.433344 0.013142 -0.350228 0.099451 0.205583 0.200381 0.218213 0.201605 0.221830 0.202963 0.221126 0.214125 0.219666 0.221077 0.220600 0.241113 0.218770 0.205921 0.226811 0.212561 0.192824 0.243057 0.233693 0.328425 0.241167 0.253710 0.372215
chargesum: 0.00000
title: Mulliken charges with hydrogens summed into heavy atoms:
elementType: F O O C C C C C C C C C C C C C C C C C C
charge: -0.223936 -0.113190 -0.053857 0.323018 0.005154 0.125055 -0.006995 0.044045 -0.039951 -0.050029 -0.074895 -0.035109 -0.074608 -0.137336 0.403617 -0.075312 0.160434 -0.192178 0.013142 -0.096519 0.099451
polarizability: 2.52595422e+02 2.47895797e+00 1.81810998e+02 1.93948636e+00 -1.61284794e+00 1.41013788e+02
1716.lowfreq: -5.5778 -0.0010 -0.0007 -0.0004 6.3272 16.4665 42.9160 58.2862 75.1743
frequency: 42.8387 58.2754 75.0559 110.5487 139.8071 153.5520 157.0210 188.3173 196.0121 209.3954 237.3699 246.8722 256.4311 270.8432 272.3090 287.3010 295.8230 330.3988 363.0123 380.1073 411.7668 417.2183 422.3521 460.2883 470.0143 493.7190 509.2363 534.1007 558.0062 564.8414 579.1550 603.2792 623.6538 654.4479 669.4240 685.1952 710.3050 772.9175 797.3664 811.9799 820.3088 829.2274 861.5617 872.5647 906.8296 920.1399 941.1299 947.6410 957.5199 980.2842 991.5784 999.5733 1012.0814 1018.6647 1035.5571 1047.2517 1054.5058 1060.4827 1074.2262 1091.9918 1122.3664 1130.0739 1138.6955 1145.9968 1153.3801 1176.6882 1190.4559 1198.3114 1203.4944 1219.1381 1227.2962 1229.0348 1235.8723 1248.7751 1266.9500 1271.6686 1282.4980 1294.3815 1304.1147 1312.7789 1320.0062 1321.7513 1327.4130 1332.4718 1335.3716 1342.4548 1362.2797 1371.6785 1375.8556 1392.1234 1394.9519 1439.1010 1454.1186 1458.0840 1465.7140 1468.1555 1474.3016 1481.8352 1487.3168 1488.8888 1491.3323 1594.8629 1629.2802 2917.4380 2931.6211 2948.5725 2954.7522 2956.1500 2967.8460 2981.0216 2986.8409 2991.0901 3000.0613 3020.0328 3030.1662 3033.5373 3039.9405 3043.5737 3049.8103 3051.3217 3078.4242 3081.9814 3125.8449 3174.0260 3551.7165 3554.1318
redmass: 4.5477 4.5731 4.4572 2.6053 4.3050 3.6492 3.3182 2.8752 1.6478 1.8698 3.0693 3.3689 2.7577 1.6765 3.0645 2.9475 2.6488 3.1799 2.3273 4.5743 3.5455 2.7317 1.1203 3.6226 4.9245 4.1574 3.6132 4.4347 3.0917 4.7775 3.4727 4.3139 2.8905 3.3544 4.2012 2.8175 4.1303 3.5154 1.7885 2.0723 1.5329 2.0089 1.9067 2.2896 2.8775 2.5485 1.3548 2.0004 2.0635 2.0756 2.9507 2.4456 2.0593 2.0378 2.2793 2.3281 1.7464 2.7371 1.9421 1.7417 1.4619 3.0550 1.6091 1.6327 1.8179 1.5772 1.8579 1.4119 2.6015 1.2996 1.2693 1.5208 1.4257 1.4860 1.5092 1.3402 1.3551 1.3344 1.3641 1.3487 1.5468 2.1138 1.4658 1.5428 1.4807 1.5895 1.5433 1.4989 1.4965 1.3215 3.3860 4.7927 1.1900 1.0692 1.0877 1.0772 1.0772 1.0763 1.1140 2.5622 1.0963 6.6869 8.5056 1.0846 1.0818 1.0833 1.0810 1.0426 1.0658 1.0592 1.0628 1.0617 1.0594 1.0630 1.0992 1.0942 1.0963 1.1008 1.1027 1.1007 1.0966 1.1032 1.0894 1.0950 1.0658 1.0654
irintensity: 0.1653 0.2880 0.5180 0.3635 0.9880 0.1260 0.1191 0.1559 1.0511 0.0862 1.2138 2.3153 8.3232 145.0575 9.0974 13.1218 24.8163 2.6454 2.7805 0.5626 1.1092 13.5702 142.2794 11.5682 0.6618 4.5632 2.0469 5.5864 3.5693 4.3433 10.1107 8.9094 1.7281 0.4333 18.2685 0.3758 0.8551 6.7199 5.4799 13.4121 24.2447 1.9230 2.9024 14.8954 22.9838 18.6135 0.3421 9.1780 13.9331 10.9096 76.2702 13.4010 12.2455 1.3000 7.3296 2.8979 2.1299 20.0556 6.9211 0.9591 4.8209 31.8772 7.7867 13.8142 168.3804 11.2219 14.0763 4.1994 48.1732 1.6427 1.5757 7.1681 17.3566 2.1275 1.4310 1.6648 14.3228 4.1235 0.2949 2.2980 1.4743 28.3967 10.3118 2.0997 0.7722 1.8790 1.0558 8.4656 5.0542 17.1506 7.4207 80.3394 10.9498 2.0827 6.2173 12.1536 1.0772 18.7818 4.8089 90.2914 19.5564 0.4436 33.1732 43.5818 23.4402 46.0265 34.0728 40.8878 19.0132 33.0423 27.8040 38.3369 34.9837 34.7181 26.8900 20.5685 49.9006 37.7856 17.1804 40.7094 32.8052 70.2286 12.3484 5.6016 3.2668 73.8990
temp: 298.150 k
press: 1.00000 atm
elementType: 9 8 8 6 6 6 6 6 6 6 6 6 6 6 6 6 6 6 6 6 6 1 1 1 1 1 1 1 1 1 1 1 1 1 1 1 1 1 1 1 1 1 1 1
symmnumber: 1
zpe: 975404.5 jmol-1
zpe.correction: 0.371512 hartree
zpe.thermalcorrener: 0.390381 hartree
zpe.thermalcorrenthalpy: 0.391325 hartree
zpe.thermalcorrgfe: 0.326207 hartree
zpe.sumelectzpe: -948.425537 hartree
zpe.sumelectthermal: -948.406667 hartree
zpe.sumelectthermalent: -948.405723 hartree
zpe.sumelectthermalfe: -948.470842 hartree
dipole: 1.4347 1.9007 -0.4437
dipole: 2.4224
quadrupole: -138.8723 -123.9508 -122.8973
quadrupole: 4.4347 -3.5907 -0.2324
quadrupole: -10.2988 4.6227 5.6762 4.4347 -3.5907 -0.2324
hfenergy: -948.7970487 hartree
pointgroup: C01 [X(C18H23F1O2)]
dipole: -0.5720369 0.7280679 0.2258102 debye
polarizability: 252.6698489|-1.6591817|181.3908231|0.87265|4.2047829|141.3595358 unknown
InChI: InChI=1S/C18H23FO2/c1-18-9-8-11-10-4-6-15(20)17(19)13(10)3-2-12(11)14(18)5-7-16(18)21/h4,6,11-12,14,16,20-21H,2-3,5,7-9H2,1H3
charge 0 multiplicity 1
44 atoms
F  4.359237 1.713445 0.234098
O  -5.196761 -1.054619 0.65438
O  5.676862 -0.731203 0.046135
C  -2.929716 0.141293 0.588747
C  -2.221498 0.883348 -0.598541
C  -0.666749 0.863905 -0.611753
C  -0.095328 -0.553191 -0.3153
C  -4.376501 -0.020521 0.008382
C  -2.272916 -1.247432 0.835374
C  -2.843902 0.252114 -1.894512
C  -0.736921 -1.159161 0.967435
C  -4.198718 -0.393133 -1.475664
C  -0.007295 1.910991 0.32112
C  -2.979803 0.958174 1.901749
C  1.431705 -0.553544 -0.234123
C  1.505289 2.017369 0.036941
C  2.170242 0.650054 -0.042586
C  2.13626 -1.782426 -0.335279
C  3.566954 0.536963 0.044547
C  3.54023 -1.8579 -0.244807
C  4.280823 -0.673876 -0.045915
H  -2.536254 1.948727 -0.556494
H  -0.359163 1.137382 -1.646434
H  -0.383473 -1.223478 -1.153262
H  -4.886144 0.967071 0.098151
H  -2.523255 -1.932864 0.002116
H  -2.709431 -1.704651 1.743897
H  -2.165062 -0.508665 -2.322245
H  -2.976857 1.027112 -2.670659
H  -0.451199 -0.553679 1.849685
H  -0.318131 -2.168928 1.14164
H  -5.049596 -0.046941 -2.086412
H  -4.169324 -1.494546 -1.555845
H  -0.163576 1.643894 1.382688
H  -0.479665 2.900566 0.167534
H  -1.997121 1.024744 2.398897
H  -3.334494 1.990244 1.716516
H  -3.672793 0.486682 2.629262
H  2.006287 2.634866 0.805062
H  1.6620 2.545467 -0.926448
H  -5.382708 -0.782876 1.588985
H  1.567113 -2.705837 -0.495612
H  4.07557 -2.80764 -0.328376
H  6.042482 0.180998 0.179329
