program: Gaussian 09
title: 000261713
version: EM64L-G09RevD.01
frameworkgroup: C1[X(C18H23N5O2)]
method: RPBEPBE
basis: SDD
operation: Freq
keyword: #p
keyword: freq=noraman
keyword: PBEPBE/SDD
title: #p freq=noraman PBEPBE/SDD
converged: YES YES NO NO
title: Mulliken charges:
elementType: O O N N N N N C C C C C C C C C C C C C C C C C C H H H H H H H H H H H H H H H H H H H H H H H
charge: -0.508561 -0.465899 -0.162025 -0.132980 -0.108520 -0.037331 -0.119324 -0.396198 -0.083575 0.155257 0.239964 -0.576543 -0.436445 -0.436279 -0.257335 0.513478 -0.292252 -0.288822 -0.391925 -0.382948 -0.393030 0.441640 -0.402059 -0.373463 -0.807526 0.228155 0.269154 0.220683 0.220029 0.294495 0.281053 0.279506 0.237607 0.269344 0.217546 0.211970 0.189094 0.211583 0.224384 0.225530 0.239738 0.227140 0.226285 0.236888 0.224216 0.223198 0.367807 0.377295
chargesum: 0.00000
title: Mulliken charges with hydrogens summed into heavy atoms:
elementType: O O N N N N N C C C C C C C C C C C C C C C C C C
charge: -0.140755 -0.088604 -0.162025 -0.132980 -0.108520 -0.037331 -0.119324 0.101111 -0.083575 0.155257 0.239964 -0.135830 0.139103 0.080834 0.012009 0.513478 0.137265 0.111855 -0.167540 -0.157418 -0.153293 0.441640 -0.174919 -0.147178 -0.123224
polarizability: 2.77852893e+02 3.41880479e+01 2.22861062e+02 -2.48473057e+01 1.74947430e+01 2.08475162e+02
1716.lowfreq: -19.0254 -7.9122 -2.8708 -0.0006 -0.0003 0.0002 7.3362 10.1802 12.4798
frequency: -16.0317 9.5809 11.2503 20.7723 26.1563 43.1378 62.9709 76.0185 99.6319 118.8949 130.7927 152.5925 156.6884 170.3347 226.0874 228.6275 239.0058 246.5949 257.3606 274.9384 294.7123 306.0817 326.5801 334.2019 375.0952 404.8041 407.4677 419.7629 450.9654 457.7305 512.7461 524.8319 542.1056 550.2715 579.1445 593.3860 638.9212 645.0479 656.5800 667.5988 674.3895 694.6969 709.9821 724.7705 782.1746 785.2364 806.2624 810.0394 816.1817 844.4900 847.2718 851.6599 887.3665 903.4410 914.4761 928.3850 946.4873 954.4543 970.4395 980.5690 984.6209 1001.2588 1014.1449 1017.4848 1034.4256 1047.7043 1059.4572 1075.3821 1091.8687 1099.2787 1116.6004 1137.5332 1165.2119 1182.7256 1192.3432 1208.0904 1211.1330 1214.5198 1219.7085 1223.5760 1225.1049 1246.5978 1265.9158 1291.1418 1301.5889 1314.9250 1319.1155 1336.3000 1345.5376 1349.7488 1367.6596 1373.2817 1374.3046 1378.1335 1383.8981 1391.5210 1396.6671 1407.9877 1412.8211 1420.3727 1436.1512 1458.9534 1462.8522 1465.7215 1466.1218 1471.6221 1473.4161 1474.4941 1477.8001 1486.2286 1510.6596 1534.1131 1569.9361 1586.2896 1627.5988 2940.4588 2971.2916 2975.3788 2986.4981 2996.9331 3001.5519 3004.4678 3037.6403 3043.0886 3047.6680 3055.4326 3061.4420 3079.1283 3081.2186 3083.6641 3108.9476 3110.8248 3131.5727 3138.5802 3156.0166 3227.5388 3323.8716 3596.3370
redmass: 5.0789 4.7914 2.8108 2.7516 1.3637 5.0913 5.2376 4.2910 5.0795 3.4193 4.4159 4.2815 4.1310 5.6587 3.7760 4.3154 1.2718 3.6388 3.7234 3.9007 2.6187 2.4010 4.7684 4.8460 2.3062 2.8449 2.8932 2.5895 3.5068 3.5778 3.0438 3.1461 2.6585 3.2881 3.5814 3.9064 6.3764 4.9738 4.6423 7.4581 1.1212 4.6051 3.8673 2.8145 4.5057 3.5881 3.5469 2.1704 1.4643 3.8677 1.2566 4.4182 2.6485 2.4623 2.1657 1.4273 1.8085 1.7454 1.3875 1.8168 1.8042 2.6222 2.8534 2.4720 2.9182 1.5588 2.3746 2.2232 2.7255 3.9726 1.5006 1.6164 2.1688 1.6256 1.1036 1.1920 1.2559 2.2635 1.5327 2.5370 1.7787 1.6322 1.5667 3.3344 1.9403 1.3639 1.4092 3.3176 1.6283 1.3527 2.1593 1.8121 1.4469 3.3486 1.7785 1.3891 1.2396 2.7654 1.2657 1.4093 2.4119 1.2192 1.1609 1.1173 1.1186 1.0574 1.1069 1.0918 1.1820 2.1698 2.7693 7.9629 7.5427 6.0482 6.4977 1.0691 1.0564 1.0378 1.0601 1.0626 1.0641 1.0625 1.1062 1.1020 1.0934 1.0963 1.1057 1.1023 1.0987 1.0992 1.0869 1.0873 1.0962 1.0973 1.0918 1.0979 1.0689 1.0668
irintensity: 2.6343 0.8946 0.4687 1.0403 0.2916 1.3843 2.7609 0.5447 1.2710 5.9106 13.7714 6.8342 2.8867 4.8201 12.9897 2.2578 133.7569 13.0890 2.8831 2.9548 1.1284 2.1027 2.2957 3.3492 0.0489 0.1438 3.5311 5.4690 17.9521 4.4850 8.7293 23.3474 17.7519 0.3593 4.2360 6.7662 0.5254 25.3994 6.2280 5.3521 197.9768 1.6526 1.3703 6.5303 4.7312 20.0884 3.4911 5.2253 44.7503 14.9918 0.2803 8.3301 0.8154 25.6934 44.8068 11.0196 19.7802 0.4182 0.2190 9.3158 19.0858 147.4003 3.4959 32.8784 52.9308 12.3911 13.6022 1.7706 8.5968 11.1954 4.9214 16.5538 26.8535 77.0461 2.8888 8.0404 17.5708 0.5720 62.5232 0.9557 1.6581 17.9847 73.4882 18.2549 44.0103 73.6332 34.2109 82.0486 10.9806 21.3387 6.0531 1.8763 10.5617 1.1134 16.8010 3.1770 11.6751 1.0707 100.4991 11.0351 17.0678 17.1160 17.1362 4.0852 10.4314 13.0544 11.7971 12.2263 28.6211 15.2289 26.4360 59.8565 614.3921 0.3457 2.1500 110.2717 45.6704 34.9081 21.6057 22.0859 48.4176 62.5608 66.7887 25.0012 50.2347 23.7726 38.3808 9.6642 11.9368 19.2304 2.8642 23.9048 44.5689 2.1989 22.6849 0.0590 235.2031 9.4581
temp: 298.150 k
press: 1.00000 atm
elementType: 8 8 7 7 7 7 7 6 6 6 6 6 6 6 6 6 6 6 6 6 6 6 6 6 6 1 1 1 1 1 1 1 1 1 1 1 1 1 1 1 1 1 1 1 1 1 1 1
symmnumber: 1
zpe: 1028390.4 jmol-1
zpe.correction: 0.391693 hartree
zpe.thermalcorrener: 0.414754 hartree
zpe.thermalcorrenthalpy: 0.415698 hartree
zpe.thermalcorrgfe: 0.335008 hartree
zpe.sumelectzpe: -1122.062198 hartree
zpe.sumelectthermal: -1122.039138 hartree
zpe.sumelectthermalent: -1122.038194 hartree
zpe.sumelectthermalfe: -1122.118884 hartree
dipole: -3.3985 1.0892 -4.0789
dipole: 5.4197
quadrupole: -161.3940 -131.1721 -139.8041
quadrupole: 16.8784 -14.3362 -1.9906
quadrupole: -17.2706 12.9513 4.3193 16.8784 -14.3362 -1.9906
hfenergy: -1122.4538917 hartree
pointgroup: C01 [X(C18H23N5O2)]
dipole: -1.4583433 0.3297445 -1.520243 debye
polarizability: 267.8132576|40.0994386|229.283805|-28.9054642|13.2420816|212.092055 unknown
InChI: InChI=1S/C18H23N5O2/c1-14-2-4-15(5-3-14)6-7-23-13-21-16-17(19-12-20-18(16)23)22(8-10-24)9-11-25/h2-5,12-13,24-25H,6-11H2,1H3
charge 0 multiplicity 1
48 atoms
O  4.689838 1.950867 -2.045027
O  6.117912 0.753373 -0.019527
N  -0.954435 -2.259933 -0.09373
N  2.98975 0.407606 0.061834
N  0.897098 -1.640203 -1.28954
N  -0.575646 -0.979799 1.982581
N  1.485062 0.344162 1.887726
C  -2.24334 -2.882543 0.252653
C  0.915236 -0.998254 -0.028218
C  -0.2377 -1.37783 0.722935
C  1.822712 -0.079758 0.61437
C  -3.428129 -2.342444 -0.599293
C  3.461953 -0.039914 -1.270467
C  3.813267 1.387274 0.818927
C  -0.229275 -2.374894 -1.283235
C  -3.692531 -0.858996 -0.390872
C  3.525732 1.069671 -2.327524
C  5.244955 0.917292 1.147373
C  -4.50332 -0.409826 0.680593
C  -3.107249 0.115059 -1.238628
C  0.349525 -0.111733 2.485543
C  -4.129835 1.94476 0.057428
C  -4.719715 0.968134 0.899536
C  -3.323287 1.492396 -1.018641
C  -4.337563 3.428779 0.308222
H  -2.158903 -3.978395 0.126846
H  -2.410568 -2.665604 1.321858
H  -4.319147 -2.936383 -0.3178
H  -3.228643 -2.552121 -1.66773
H  2.766275 -0.809064 -1.644926
H  4.466654 -0.488531 -1.165142
H  3.271288 1.584524 1.758119
H  3.869358 2.325301 0.234226
H  -0.553207 -3.012188 -2.103184
H  2.592458 1.666585 -2.32607
H  3.656651 0.593611 -3.320372
H  5.683975 1.66881 1.840545
H  5.222777 -0.057274 1.667584
H  -4.971151 -1.142715 1.350456
H  -2.479186 -0.207719 -2.078662
H  0.15974 0.266278 3.494947
H  -5.353193 1.29093 1.73478
H  -2.860674 2.226824 -1.689909
H  -3.441027 3.881893 0.773857
H  -4.528891 3.977116 -0.632122
H  -5.189152 3.609083 0.987058
H  4.837201 2.586483 -2.786226
H  5.78545 1.33561 -0.765754
