program: Gaussian 09
title: 000261635
version: EM64L-G09RevD.01
frameworkgroup: C1[X(C15H13Cl2NO)]
method: RPBEPBE
basis: SDD
operation: Freq
keyword: #p
keyword: freq=noraman
keyword: PBEPBE/SDD
title: #p freq=noraman PBEPBE/SDD
converged: YES YES NO NO
title: Mulliken charges:
elementType: Cl Cl O N C C C C C C C C C C C C C C C H H H H H H H H H H H H H
charge: -0.088199 -0.061554 -0.263551 -0.601952 -0.321149 -0.607678 0.411216 0.605264 -0.359959 -0.406317 -0.358391 -0.362396 0.229162 -0.230856 -0.236831 -0.240762 -0.238356 -0.114271 -0.234104 0.252261 0.257545 0.262510 0.246439 0.291850 0.265731 0.255089 0.257647 0.258323 0.236112 0.238831 0.322980 0.335368
chargesum: 0.00000
title: Mulliken charges with hydrogens summed into heavy atoms:
elementType: Cl Cl O N C C C C C C C C C C C C C C C
charge: -0.088199 -0.061554 -0.263551 0.056395 -0.068888 -0.087623 0.411216 0.605264 -0.113521 -0.114467 -0.358391 -0.096665 0.229162 0.024233 0.020816 0.017561 -0.002244 -0.114271 0.004727
polarizability: 2.41309601e+02 5.92807985e+00 1.84026106e+02 -1.85545428e+01 6.28119912e+00 1.30722561e+02
1716.lowfreq: -9.0520 -4.1131 -0.0023 0.0016 0.0027 5.7021 24.6577 34.3184 42.4830
frequency: 24.6254 34.2701 42.4616 62.3954 71.9705 82.2283 129.8683 146.5952 160.4394 181.8420 186.0351 259.9538 293.9872 300.2318 337.8439 386.6695 396.6617 408.2821 421.6645 448.8544 451.9183 489.8751 508.8046 549.0106 560.3655 584.3851 607.0435 626.3317 645.5800 662.9431 692.0353 719.9060 728.7173 762.7168 781.1032 812.6851 832.8554 844.8783 866.8691 897.5236 944.8856 955.3385 958.2589 973.9666 991.0590 1000.6755 1005.5375 1019.9803 1039.4870 1068.7742 1076.5058 1118.9840 1121.3620 1167.5616 1172.0011 1190.7188 1201.1974 1212.9734 1241.9596 1285.2043 1304.9135 1313.0049 1320.9334 1349.7450 1367.1176 1375.6162 1398.1131 1426.1404 1456.4655 1467.9355 1483.5490 1570.8743 1584.5623 1592.2949 1601.6152 1603.9730 1642.5563 2986.9669 3013.8378 3089.1837 3127.1930 3135.6560 3144.9984 3147.5847 3161.7139 3168.0271 3171.3206 3176.2380 3501.4749 3657.9194
redmass: 4.3756 9.9257 7.2786 5.4340 5.7019 6.9153 6.7404 5.3452 6.3707 6.9536 6.9065 5.9426 5.0884 6.1874 6.9663 8.3320 4.5315 2.8036 2.2540 3.6786 4.4440 3.3402 3.8869 2.2231 1.3362 1.6388 3.8584 5.7848 3.3254 5.4798 3.8897 4.2829 4.2726 1.2401 3.3045 2.9602 1.3916 1.6545 1.4383 3.0503 2.1428 1.4236 1.4078 1.3885 1.3507 3.9606 6.4115 3.9755 2.1207 1.8709 2.6287 1.6730 1.4599 1.2840 1.0962 2.0796 1.1670 2.0130 1.4627 1.3447 1.3123 1.4566 1.5016 3.2174 5.8734 6.4745 2.7298 2.2022 2.3875 1.1324 2.2161 5.9892 7.2224 1.4895 5.7959 6.6130 3.3996 1.0813 1.0627 1.0999 1.0896 1.0862 1.0906 1.0903 1.0950 1.0950 1.0961 1.1000 1.0451 1.1046
irintensity: 2.9542 0.4317 0.8311 5.7593 0.5502 9.2475 0.9475 0.9113 3.3695 1.6456 2.4367 0.7666 0.2291 1.5138 4.2620 5.3472 0.6463 1.9275 11.0424 3.6767 20.5848 24.9146 1.0944 47.8917 164.3652 79.5843 5.8753 3.5958 3.5013 10.6263 37.5010 9.7738 0.3431 85.4221 13.7919 13.2723 5.5695 39.6552 1.4546 5.6090 9.9289 0.9564 1.2599 0.5866 0.5799 34.7495 52.2534 5.6100 6.3078 2.3848 36.3742 4.2252 7.9475 4.9731 1.1682 0.0189 0.3602 1.2514 3.6485 5.5444 7.0487 5.6729 14.0412 137.9144 3.6303 4.1957 8.3851 25.6350 32.5025 41.3304 79.0850 8.9670 6.7689 91.6054 4.6120 3.4021 268.5494 3.9565 14.8890 7.7976 10.0833 0.8844 3.6333 6.5248 10.7035 4.0386 2.8944 13.2880 26.2247 50.5040
temp: 298.150 k
press: 1.00000 atm
elementType: 17 17 8 7 6 6 6 6 6 6 6 6 6 6 6 6 6 6 6 1 1 1 1 1 1 1 1 1 1 1 1 1
symmnumber: 1
zpe: 634561.4 jmol-1
zpe.correction: 0.241692 hartree
zpe.thermalcorrener: 0.259129 hartree
zpe.thermalcorrenthalpy: 0.260074 hartree
zpe.thermalcorrgfe: 0.194020 hartree
zpe.sumelectzpe: -1628.165457 hartree
zpe.sumelectthermal: -1628.148019 hartree
zpe.sumelectthermalent: -1628.147075 hartree
zpe.sumelectthermalfe: -1628.213129 hartree
dipole: -4.4881 -2.2377 0.9914
dipole: 5.1121
quadrupole: -130.3482 -121.5075 -123.7305
quadrupole: 0.1606 -0.8415 10.7540
quadrupole: -5.1528 3.6878 1.4649 0.1606 -0.8415 10.7540
hfenergy: -1628.4071489 hartree
pointgroup: C01 [X(C15H13Cl2N1O1)]
dipole: -1.8091441 -0.4111598 0.7765439 debye
polarizability: 227.0981116|-3.8933317|181.8892793|-38.9213815|18.3695858|147.0708769 unknown
InChI: InChI=1S/C15H13Cl2NO/c16-11-7-5-10(6-8-11)13(9-15(18)19)12-3-1-2-4-14(12)17/h1-8,13H,9,18H2
charge 0 multiplicity 1
32 atoms
Cl -2.607597 1.31377 2.154144
Cl 4.960614 -2.333176 -1.138126
O  1.232711 3.645487 -1.179441
N  0.115015 3.755366 0.853803
C  -0.279507 0.714173 0.104688
C  -0.560456 2.00596 -0.735008
C  1.023099 -0.016635 -0.253669
C  -1.518752 -0.186146 0.014221
C  1.358017 -1.19471 0.467967
C  1.927859 0.446297 -1.240871
C  -2.641673 -0.000967 0.85559
C  -1.636524 -1.198807 -0.974975
C  0.347171 3.195893 -0.391795
C  2.548109 -1.904843 0.209986
C  3.126369 -0.255116 -1.515821
C  -3.81837 -0.765928 0.762936
C  -2.804828 -1.979751 -1.10106
C  3.416628 -1.421895 -0.789151
C  -3.897918 -1.768266 -0.230207
H  -0.192536 1.027451 1.164268
H  -0.455045 1.792832 -1.811504
H  -1.609598 2.307366 -0.559728
H  0.675753 -1.569186 1.240624
H  1.735634 1.374755 -1.787916
H  -0.785483 -1.373405 -1.642042
H  2.795598 -2.809887 0.772106
H  3.820744 0.113704 -2.276205
H  -4.651682 -0.583131 1.447294
H  -2.861575 -2.752196 -1.875114
H  -4.806539 -2.373057 -0.316483
H  -0.621035 3.408693 1.469602
H  0.690297 4.542656 1.152387
