program: Gaussian 09
title: 000261579
version: EM64L-G09RevD.01
frameworkgroup: C1[X(C6H7ClN2O)]
method: RPBEPBE
basis: SDD
operation: Freq
keyword: #p
keyword: freq=noraman
keyword: PBEPBE/SDD
title: #p freq=noraman PBEPBE/SDD
converged: NO NO NO NO
title: Mulliken charges:
elementType: Cl O N N C C C C C C H H H H H H H
charge: -0.008520 -0.268016 -0.126257 -0.011688 -0.222902 0.219411 -0.677734 -0.277247 -0.087819 -0.226316 0.235368 0.235339 0.215026 0.230314 0.230319 0.270162 0.270559
chargesum: 0.00000
title: Mulliken charges with hydrogens summed into heavy atoms:
elementType: Cl O N N C C C C C C
charge: -0.008520 -0.268016 -0.126257 -0.011688 0.247805 0.219411 -0.002076 -0.007084 0.182740 -0.226316
polarizability: 1.50718205e+02 -1.80706398e-03 8.16453232e+01 -5.16188711e-03 1.22325896e-03 4.58283811e+01
1716.lowfreq: -0.0019 -0.0017 -0.0015 5.8619 6.8600 16.6809 49.3433 98.1193 123.8057
frequency: 49.3038 98.1178 123.8042 132.8463 241.0168 271.8436 288.0877 313.1822 397.5075 400.1268 466.1198 510.4002 604.1646 662.1843 730.8074 770.8690 798.8801 829.6514 876.8008 959.5237 963.2076 1017.4494 1048.7091 1109.0486 1120.8811 1133.1063 1145.5452 1246.1784 1248.8612 1296.4591 1332.4872 1375.3017 1400.6050 1462.5429 1471.3658 1486.0195 1506.2215 1560.1348 2996.0800 3017.0779 3074.4473 3093.0919 3110.1132 3169.6849 3189.5795
redmass: 3.4962 2.9378 4.4776 3.2868 1.2118 6.5219 4.9928 5.2007 5.4695 6.6484 5.6373 3.9528 8.7442 7.8827 6.2365 5.6307 1.0960 1.5234 4.7052 4.7890 1.3225 2.3469 3.5440 2.3139 1.6695 1.4496 4.5448 1.1366 3.2466 3.0482 1.8742 2.1110 1.2982 1.0403 1.0680 1.0763 5.1781 6.4467 1.0357 1.0586 1.1065 1.0983 1.1030 1.0902 1.1002
irintensity: 0.6309 4.1086 3.8500 6.8202 0.8411 1.9511 6.9450 1.3371 0.1698 0.1008 4.8802 0.0213 2.2136 53.0963 0.0338 7.1399 3.6095 48.5052 48.4407 8.3565 0.0709 83.4255 14.2458 17.4214 66.9083 5.0568 3.4561 0.0049 148.8211 37.6328 296.0863 131.5369 13.0367 12.5307 9.3897 10.8981 24.9923 32.3567 21.3006 14.5058 4.8482 26.5218 43.5872 0.6401 1.4155
temp: 298.150 k
press: 1.00000 atm
elementType: 17 8 7 7 6 6 6 6 6 6 1 1 1 1 1 1 1
symmnumber: 1
zpe: 323586.5 jmol-1
zpe.correction: 0.123248 hartree
zpe.thermalcorrener: 0.132914 hartree
zpe.thermalcorrenthalpy: 0.133858 hartree
zpe.thermalcorrgfe: 0.087383 hartree
zpe.sumelectzpe: -876.827108 hartree
zpe.sumelectthermal: -876.817442 hartree
zpe.sumelectthermalent: -876.816498 hartree
zpe.sumelectthermalfe: -876.862973 hartree
dipole: 2.6597 3.1837 -0.0001
dipole: 4.1485
quadrupole: -60.6831 -65.2669 -65.4892
quadrupole: -8.0989 -0.0005 0.0001
quadrupole: 3.1300 -1.4538 -1.6761 -8.0989 -0.0005 0.0001
hfenergy: -876.9503555 hartree
pointgroup: C01 [X(C6H7Cl1N2O1)]
dipole: 1.0206336 1.273648 -0.0065329 debye
dipolederiv: -0.9067537 -0.0913451 0.0016118 -0.1352603 -0.1118784 0.0004037 0.0017806 0.0003389 -0.0603312 -1.9811881 0.1823478 0.0017082 0.1220063 -0.3725156 0.000166 0.0017728 0.0000705 -0.2915054 -0.4657851 0.2450939 -0.0006104 -0.7138243 -0.0817439 0.0004896 0.0031584 -0.0009278 -0.2191093 -0.3636248 -0.3033968 0.0014692 0.4270636 -0.1027097 -0.0009265 -0.0014072 0.0001419 -0.1780744 0.9890835 -0.1992636 -0.0001154 -0.5137713 0.3996707 0.0005518 0.0011728 0.0000823 0.3360684 1.7806292 -0.0530205 -0.0020446 0.4907312 -0.024962 0.0003088 -0.0041447 0.0010941 0.2341163 -0.1799869 -0.0174305 0.0002725 0.0058329 0.050361 -0.0000344 0.0001513 0.0000187 0.0674057 -0.3386493 -0.0165316 0.0004068 0.1892475 0.0812559 -0.0009895 -0.0003548 -0.0006778 -0.0967539 -0.1607777 -0.0379727 0.0003204 -0.0868851 0.0792434 -0.0003398 0.0005099 -0.0004118 -0.0409596 1.4189487 0.2640185 -0.003059 0.0530726 0.0539781 -0.0000812 -0.0022163 -0.0003828 0.054025 -0.0285612 -0.0281106 0.0573361 0.087704 -0.0058126 0.0663364 0.0345163 0.0927862 -0.0540421 -0.0288766 -0.0286862 -0.057177 0.0874005 -0.0069627 -0.0669577 -0.0352031 -0.0931054 -0.0528255 -0.0455142 0.0977392 -0.0001816 0.1319671 -0.0530103 0.000511 -0.0003113 0.0005435 0.1174785 0.0885373 -0.0156401 0.0112704 -0.0833884 0.032203 0.1059628 0.0472431 0.107247 -0.0637188 0.0885183 -0.0158875 -0.0114004 -0.0838686 0.0306701 -0.1064657 -0.046842 -0.1078828 -0.062067 0.0845951 -0.053324 0.0003195 -0.0452802 -0.0013164 0.0006904 0.0002845 0.0007 0.1563386 0.0494055 0.07141 -0.0001267 0.0672526 0.0335293 0.0003746 -0.0001103 0.0003652 0.1539548 unknown
polarizability: 150.6892871|1.4069425|81.6734479|-0.1585075|-0.142968|45.8291741 unknown
InChI: InChI=1S/C6H7ClN2O/c1-2-10-6-4-3-5(7)8-9-6/h3-4H,2H2,1H3
charge 0 multiplicity 1
17 atoms
Cl -3.930985 -0.497004 0.008348
O  1.856547 0.536511 -0.004259
N  0.035883 -0.968571 0.004337
N  -1.325541 -1.193624 0.007239
C  2.747681 -0.670981 -0.000963
C  0.498254 0.322893 -0.001475
C  4.178575 -0.144927 -0.00402
C  -0.35341 1.464492 -0.004724
C  -1.731883 1.229795 -0.001742
C  -2.151796 -0.125467 0.004247
H  2.511389 -1.274314 0.89365
H  2.509727 -1.280416 -0.890973
H  4.880177 -0.999207 -0.001474
H  4.375479 0.464191 -0.902653
H  4.376873 0.470659 0.889887
H  0.06734 2.472719 -0.009334
H  -2.455408 2.048553 -0.003886
