program: Gaussian 09
title: 000261528
version: EM64L-G09RevD.01
frameworkgroup: C1[X(C7H10O4)]
method: RPBEPBE
basis: SDD
operation: Freq
keyword: #pfreq=noraman
keyword: PBEPBE/SDD
title: #p freq=noraman PBEPBE/SDD
converged: YES YES NO NO
title: Mulliken charges:
elementType: O O O O C C C C C C C H H H H H H H H H H
charge: -0.293076 -0.223692 -0.425588 -0.206596 0.400277 -0.224910 0.229907 -0.546421 -0.751724 0.213825 -0.712679 0.247908 0.254007 0.251799 0.232317 0.224806 0.240174 0.222929 0.237848 0.264360 0.364529
chargesum: 0.00000
title: Mulliken charges with hydrogens summed into heavy atoms:
elementType: O O O O C C C C C C C
charge: -0.293076 -0.223692 -0.061059 -0.206596 0.400277 0.022998 0.229907 -0.040615 -0.054427 0.213825 0.012459
polarizability: 9.25482660e+01 6.20612193e+00 9.11655916e+01 2.54161565e+00 -7.65997980e-01 6.88805018e+01
1716.lowfreq: -13.7738 -0.0010 -0.0009 -0.0008 13.4771 18.2399 74.5406 94.1391 133.3752
frequency: 74.3425 94.1237 133.3520 177.8223 230.4056 233.3115 284.9640 297.3257 341.1359 348.6083 372.8252 388.5485 466.7998 480.6646 508.7329 551.2593 555.8363 580.8243 664.3709 764.6620 810.0593 854.0544 870.6518 892.6907 939.5073 957.0755 996.0922 1031.2503 1055.4145 1070.4909 1119.5682 1138.8913 1163.8392 1214.4688 1224.6082 1283.0806 1330.0535 1355.9804 1392.2130 1394.6250 1422.4878 1439.9713 1459.6227 1469.2859 1471.6758 1481.5437 1679.0383 2987.0278 2995.4114 2999.5853 3072.8179 3078.7316 3099.0533 3099.5911 3112.6184 3115.5681 3554.3597
redmass: 3.7277 7.0899 2.5559 1.1690 2.4253 1.0745 3.3979 3.4040 2.2166 4.8628 2.8161 1.6653 4.3495 4.5291 5.3265 4.3839 3.8813 4.7493 5.9238 4.6904 3.8287 3.6204 3.9649 3.2332 2.2549 2.0749 1.5541 1.8210 1.6277 1.5822 2.0633 2.4945 3.2800 1.6766 1.5789 1.3063 2.7890 2.0624 1.2479 1.2562 1.2127 1.4522 1.0766 1.0725 1.0646 1.6463 11.9554 1.0377 1.0627 1.0360 1.0963 1.0983 1.0999 1.0995 1.0964 1.0940 1.0656
irintensity: 9.4163 0.7987 0.1018 0.7662 1.7618 0.1543 2.9418 2.1881 24.0935 10.8778 15.8950 100.3840 8.4797 7.2002 13.9943 32.2157 19.2304 11.3578 8.0718 15.4040 9.2379 17.9633 182.7799 15.7086 15.3459 22.4111 1.2100 16.4623 54.3195 158.0303 125.3802 49.3631 45.8543 11.4867 38.0187 19.1984 24.0852 10.7011 36.6948 17.5321 38.4467 18.9596 9.0043 15.2141 11.6348 3.9322 286.6302 15.8709 7.0299 9.7726 1.9284 20.2781 11.4297 17.3093 3.4679 24.3814 11.7691
temp: 298.150 k
press: 1.00000 atm
elementType: 8 8 8 8 6 6 6 6 6 6 6 1 1 1 1 1 1 1 1 1 1
symmnumber: 1
zpe: 425768.4 jmol-1
zpe.correction: 0.162167 hartree
zpe.thermalcorrener: 0.173199 hartree
zpe.thermalcorrenthalpy: 0.174143 hartree
zpe.thermalcorrgfe: 0.126209 hartree
zpe.sumelectzpe: -572.751403 hartree
zpe.sumelectthermal: -572.740371 hartree
zpe.sumelectthermalent: -572.739427 hartree
zpe.sumelectthermalfe: -572.787361 hartree
dipole: 0.3374 -4.1335 2.6342
dipole: 4.9131
quadrupole: -52.8360 -74.3114 -67.8334
quadrupole: 5.3403 0.4926 2.5831
quadrupole: 12.1576 -9.3178 -2.8398 5.3403 0.4926 2.5831
hfenergy: -572.9135701 hartree
pointgroup: C01 [X(C7H10O4)]
dipole: -0.2356748 -1.6048216 -1.051368 debye
dipolederiv: -0.4408038 -0.0506975 -0.0079166 -0.0474742 -0.3750338 0.0242586 0.0054346 0.0632668 -0.6398121 -0.7764804 0.6462103 0.0002931 0.4125746 -1.3934888 -0.1493921 -0.0264049 0.0818619 -0.3726626 -0.3195813 0.1456321 0.1044324 0.1628159 -0.6414706 0.0181945 0.1984297 -0.2131679 -0.8773892 -0.5282556 -0.1081281 -0.0368843 0.0401373 -1.2245737 -0.0968302 -0.0545975 -0.147475 -0.3486625 0.3777662 0.0969528 0.0284932 0.1004858 0.357572 -0.0146914 0.1077188 -0.1063744 0.3596168 0.0323617 0.0634296 -0.0075088 0.0844159 0.1459115 0.007403 -0.1656911 0.0447701 0.1367346 0.6578544 -0.1670423 -0.0526343 -0.2938276 1.0894813 0.0860833 -0.2317963 0.2321617 0.9262778 -0.2780295 -0.1235288 -0.1341511 -0.1493633 -0.1160313 0.0039526 -0.1773109 -0.0302078 0.0316961 -0.0866556 -0.0839198 -0.0545244 -0.0832863 -0.0368831 -0.0087861 -0.0185866 0.0229336 0.0286331 1.1380139 -0.4561735 0.1252542 -0.2142432 1.8143216 0.1649482 0.2315518 0.0569521 0.2913165 -0.1514532 0.099724 -0.1043937 0.0606001 -0.0518287 0.042452 -0.0244728 0.0379663 -0.1274626 0.049837 -0.0455817 0.0214091 -0.0066547 -0.0985285 -0.0372677 0.0408656 -0.0229513 0.0855988 -0.0081818 0.0643765 0.0249977 0.0600257 0.0017594 -0.0125148 0.0556355 -0.036315 0.0987801 0.0989576 -0.0246924 0.0155581 -0.0169971 0.0763724 -0.0051586 -0.0078343 0.0306193 -0.0478607 -0.0574902 0.0662657 0.0222724 0.113312 0.0124709 -0.0636879 0.0631678 -0.0534829 0.0726026 0.0610952 0.0010796 -0.0010174 -0.010266 0.1077871 0.0112024 -0.0493178 -0.0031813 -0.1226979 0.0696071 -0.0005046 -0.020151 -0.0616085 -0.0933301 0.0553729 0.0097787 0.0758095 0.082856 0.0841602 -0.00173 -0.0218768 0.0347213 -0.1221956 -0.03943 -0.0102581 -0.0613477 0.0809195 -0.09053 -0.0476973 0.027541 -0.0851905 0.0689829 0.0380315 0.0551352 0.0377733 0.0814877 0.1132022 0.0050651 0.0502644 0.005723 0.1105488 -0.017259 0.0300249 -0.0063022 -0.0645124 0.0546059 -0.0790398 0.0205428 -0.1059002 0.3681562 -0.0068813 -0.0314722 -0.003309 0.3245405 unknown
polarizability: 91.3637898|-6.2649244|92.1807416|3.2016385|0.4927969|69.049828 unknown
InChI: InChI=1S/C7H10O4/c1-6-3-4(8)10-7(2,9)5(6)11-6/h5,9H,3H2,1-2H3
charge 0 multiplicity 1
21 atoms
O  -0.959346 -0.713936 1.370842
O  1.283896 0.684882 0.238999
O  1.284085 -0.915024 -1.556106
O  0.453372 2.807461 0.248723
C  -1.428051 -0.360919 -0.048488
C  -0.269606 -1.275329 0.160274
C  1.136994 -0.758336 -0.117788
C  -1.107997 1.067483 -0.463914
C  -2.791173 -0.898132 -0.425805
C  0.232839 1.60391 0.033671
C  2.234194 -1.456486 0.681963
H  -0.390297 -2.355332 0.011422
H  -1.884486 1.768815 -0.112924
H  -1.095255 1.11986 -1.571383
H  -3.592805 -0.25982 -0.012656
H  -2.906389 -0.928858 -1.525148
H  -2.929956 -1.918582 -0.031176
H  2.279632 -2.526028 0.414075
H  3.212702 -0.986642 0.477809
H  2.030651 -1.360838 1.760918
H  2.2278 -0.739351 -1.806108
