program: Gaussian 09
title: 000261527
version: EM64L-G09RevD.01
frameworkgroup: C1[X(C7H7NO2)]
method: RPBEPBE
basis: SDD
operation: Freq
keyword: #pfreq=noraman
keyword: PBEPBE/SDD
title: #p freq=noraman PBEPBE/SDD
converged: YES YES NO YES
title: Mulliken charges:
elementType: O O N C C C C C C C H H H H H H H
charge: -0.485614 -0.257034 -0.394862 0.305122 0.150501 -0.313935 -0.347029 -0.233902 -0.220093 -0.076271 0.307460 0.220295 0.230244 0.229142 0.344348 0.371336 0.170293
chargesum: 0.00000
title: Mulliken charges with hydrogens summed into heavy atoms:
elementType: O O N C C C C C C C
charge: -0.114278 -0.257034 -0.050514 0.305122 0.150501 -0.006475 -0.126734 -0.003658 0.009049 0.094022
polarizability: 1.29199863e+02 1.97780330e+00 1.02078619e+02 -3.24937006e-03 -3.55516017e-03 3.59583212e+01
1716.lowfreq: -10.4772 -0.0004 -0.0002 0.0008 2.6931 12.4118 81.0208 160.2823 178.3098
frequency: 81.0099 160.2817 178.3049 238.3013 269.8147 308.9134 364.7966 420.4332 456.1650 506.1028 555.3360 564.1760 715.1018 721.4429 740.7872 751.3122 816.4965 839.4421 848.8898 933.7809 950.6788 986.4950 1032.8915 1063.3636 1123.6171 1143.7003 1170.8801 1210.2563 1267.5962 1308.7108 1375.9593 1405.3728 1440.8992 1488.2395 1518.0801 1605.0778 1622.7247 1635.7029 2933.5791 3119.7050 3144.2645 3166.3731 3193.4861 3498.2175 3615.9617
redmass: 6.0049 3.7290 6.7223 3.3930 8.2551 1.1410 3.2322 4.6891 3.2383 6.6051 6.9314 3.7354 5.5816 1.8654 1.7535 1.2522 6.2123 6.5886 1.3819 1.3648 1.5703 1.3028 2.1452 2.6972 2.4906 1.2434 1.0734 1.9334 1.8639 1.7879 1.3737 4.1496 2.5595 2.1381 2.5977 5.7102 6.7597 5.0854 1.0862 1.0889 1.0891 1.0976 1.0959 1.0770 1.0665
irintensity: 2.7881 17.1310 10.0754 26.8190 4.2078 139.8238 10.8861 8.2593 8.5620 12.5287 2.0196 0.0306 4.5570 12.1477 23.0555 175.1393 25.1815 8.6628 2.2013 6.6061 1.3118 3.6480 7.4910 108.2338 53.7940 68.3576 0.2656 8.3274 63.4966 22.9116 8.3427 19.8343 130.9056 34.8445 293.1406 34.7368 109.1933 149.9211 123.0682 12.6091 10.7379 17.6744 5.0778 50.6478 46.4012
temp: 298.150 k
press: 1.00000 atm
elementType: 8 8 7 6 6 6 6 6 6 6 1 1 1 1 1 1 1
symmnumber: 1
zpe: 337901.5 jmol-1
zpe.correction: 0.128700 hartree
zpe.thermalcorrener: 0.137321 hartree
zpe.thermalcorrenthalpy: 0.138265 hartree
zpe.thermalcorrgfe: 0.095156 hartree
zpe.sumelectzpe: -475.426296 hartree
zpe.sumelectthermal: -475.417675 hartree
zpe.sumelectthermalent: -475.416731 hartree
zpe.sumelectthermalfe: -475.459841 hartree
dipole: -3.5771 3.6842 0.0000
dipole: 5.1350
quadrupole: -56.0869 -49.5799 -62.0596
quadrupole: 4.6726 0.0005 -0.0017
quadrupole: -0.1781 6.3289 -6.1508 4.6726 0.0005 -0.0017
hfenergy: -475.5549964 hartree
pointgroup: C01 [X(C7H7N1O2)]
dipole: -1.4824024 1.372599 0.0000027 debye
dipolederiv: -0.1102798 -0.0376971 0.0000188 0.0857703 -1.3686129 0.0000551 0.0000138 0.0000386 -0.4318828 -0.8288079 0.0716466 0.0000107 0.7731972 -0.736317 -0.0000047 0.0000778 -0.0000286 -0.363813 -1.6371879 -0.0683551 0.0000816 0.0385763 -0.3866374 -0.000007 0.000055 0.0000144 -0.3143535 0.7968089 0.4576322 -0.000058 0.4249725 0.0102289 -0.0000168 -0.000043 -0.0000064 0.0697675 -0.1436927 -0.0995662 0.000008 -0.0813988 1.2025959 -0.0000707 -0.0000018 -0.0000703 0.0251024 -0.0318907 0.0143959 0.0000034 -0.0905833 -0.0249659 -0.0000059 0.0000091 -0.0000105 -0.1513675 0.0692138 -0.1772994 0.0000044 0.0477791 -0.1683778 -0.0000008 -0.0000083 0.0000014 -0.1847506 -0.141663 -0.0530913 0.000003 0.0615116 0.087922 -0.00002 -0.0000031 -0.0000134 -0.179611 0.0278259 0.0583747 -0.0000066 -0.1319361 0.0132901 -0.0000066 0.0000024 -0.0000129 -0.1628011 1.7430871 -0.1546086 -0.0000792 -0.8749268 0.9443677 0.0000034 -0.0001581 -0.0000168 0.1404793 0.086048 0.0625267 -0.0000056 0.0345642 0.1055942 0.0000059 -0.0000065 0.0000018 0.1845288 -0.0401381 0.0941377 -0.0000007 0.1235259 -0.0173366 0.0000098 -0.0000017 0.0000102 0.1745161 0.0783524 -0.0049808 0.0000022 -0.0256377 -0.1111266 0.0000196 0.0000027 0.0000195 0.1657714 -0.0774232 -0.0884916 0.0000108 -0.0830549 0.0454484 0.0000096 0.0000096 0.0000094 0.1664622 0.2019415 -0.0140643 0.000007 -0.0406438 0.1981506 0.0000069 -0.0000109 0.0000091 0.335315 0.0751836 0.0462912 -0.000014 -0.0337799 0.4009315 0.0000002 -0.0000101 0.0000122 0.4021829 -0.067378 -0.1068508 0.0000141 -0.2279357 -0.1951552 0.0000222 0.0000732 0.0000426 0.1244539 unknown
polarizability: 128.9131809|3.4065667|102.3653011|-0.0030558|-0.0037229|35.9583212 unknown
InChI: InChI=1S/C7H7NO2/c9-5-8-6-3-1-2-4-7(6)10/h1-5,8,10H
charge 0 multiplicity 1
17 atoms
O  -0.83372 2.30063 -0.000215
O  3.079676 -0.775874 -0.000281
N  1.413514 0.900577 -0.000183
C  0.210902 0.146971 -0.000104
C  -1.001397 0.895493 -0.000129
C  0.145344 -1.268168 -0.000009
C  -2.253641 0.255898 -0.000063
C  -1.114319 -1.910037 0.000054
C  -2.309972 -1.15827 0.000028
C  2.71899 0.433518 -0.000192
H  1.076758 -1.837557 0.000026
H  -3.176968 0.849272 -0.000079
H  -1.156036 -3.004086 0.000128
H  -3.2823 -1.661278 0.000081
H  1.274579 1.916825 -0.00024
H  -1.7024 2.769241 -0.000289
H  3.447588 1.276646 -0.000333
