program: Gaussian 09
title: 000261517
version: EM64L-G09RevD.01
frameworkgroup: C1[X(C14H14N2O4)]
method: RPBEPBE
basis: SDD
operation: Freq
keyword: #p
keyword: freq=noraman
keyword: PBEPBE/SDD
title: #p freq=noraman PBEPBE/SDD
converged: YES YES NO NO
title: Mulliken charges:
elementType: O O O O N N C C C C C C C C C C C C C C H H H H H H H H H H H H H H
charge: -0.491419 -0.244754 -0.223127 -0.237978 0.013151 -0.183570 -0.177115 0.361547 -0.562500 0.180954 -0.485305 0.329402 0.341380 -0.382631 -0.348789 -0.345889 -0.169102 -0.338891 -0.182076 -0.536039 0.254835 0.250574 0.242925 0.329410 0.281874 0.251788 0.383894 0.249593 0.244493 0.249944 0.236358 0.225877 0.228432 0.252753
chargesum: 0.00000
title: Mulliken charges with hydrogens summed into heavy atoms:
elementType: O O O O N N C C C C C C C C C C C C C C
charge: -0.107525 -0.244754 -0.223127 -0.237978 0.013151 -0.183570 0.077721 0.361547 -0.069000 0.180954 -0.155895 0.329402 0.341380 -0.100757 -0.097001 -0.096296 0.075391 -0.088947 0.054282 0.171023
polarizability: 2.80776532e+02 -2.03591271e+01 1.99969110e+02 1.31375910e+01 1.23855361e+01 9.99422070e+01
1716.lowfreq: -5.3598 0.0006 0.0006 0.0009 2.6859 6.7732 25.2078 36.6562 41.3260
frequency: 25.2047 36.6385 41.2889 58.1816 82.5113 108.1885 117.1153 155.1583 181.6209 193.1008 216.5724 231.6432 266.2111 279.6254 305.6086 330.0481 338.9532 379.7980 405.4362 443.0373 455.0980 470.7322 494.9903 551.4222 591.5697 593.4823 610.0151 629.7476 651.6547 669.4944 720.4291 738.5341 747.0102 764.9405 778.1496 820.6465 833.7853 836.1104 855.7948 897.6068 916.0127 936.2119 960.4843 972.1102 978.5609 995.5134 1003.1918 1013.5960 1023.5198 1041.7034 1065.4045 1096.5286 1111.4074 1133.1761 1143.7940 1167.8511 1175.4643 1184.4634 1206.3040 1222.1208 1228.4160 1255.6588 1268.1228 1285.8243 1294.4071 1308.9114 1335.8251 1343.4923 1401.6850 1415.9265 1426.6268 1437.6159 1438.1203 1458.3927 1466.5388 1469.4831 1470.2319 1478.6872 1563.7103 1565.5664 1591.7762 1617.6491 2970.1710 2979.1266 2993.6869 3001.7603 3063.0695 3095.2396 3135.0273 3137.9123 3145.3110 3163.0250 3164.9715 3177.2329 3183.3975 3186.0743
redmass: 5.9863 6.2284 6.1155 4.5012 4.4114 4.2096 5.4216 6.1987 4.5333 7.0125 1.1636 5.1566 3.1571 5.1403 4.6928 5.6325 7.5517 6.0783 3.3086 2.7854 2.9927 4.8990 3.6579 6.3553 3.8981 5.0071 6.0226 7.0012 5.7203 4.8884 5.6982 5.7003 2.3073 1.5583 7.3544 1.5283 2.1179 1.6312 2.5802 1.4110 3.2475 1.5121 1.4688 1.3462 5.6092 3.9673 1.3779 3.1474 4.5565 2.3513 4.2956 1.6815 1.2585 2.0228 1.4614 1.0735 1.4960 1.2098 5.1739 1.7434 1.8627 2.2203 2.0314 1.2841 1.3880 3.0423 1.6577 4.5951 7.4131 1.7928 1.9712 1.3384 1.5562 2.0243 2.3691 1.0546 1.0705 1.5010 6.7300 5.9675 5.7883 7.1915 1.0326 1.0775 1.0686 1.0715 1.1044 1.0945 1.1001 1.0874 1.0906 1.0951 1.0880 1.1016 1.0915 1.0956
irintensity: 3.3974 2.0014 0.5727 3.8619 1.0398 5.0351 1.7774 1.4943 5.3713 4.5683 0.0793 3.2184 3.8710 2.8962 0.7381 2.3743 1.1551 1.8099 2.7752 0.4043 0.5520 6.3078 18.7849 5.0041 11.0092 11.9378 8.4716 7.7708 4.5948 14.7316 1.8779 2.7867 38.9040 46.6385 5.4760 31.7176 7.5108 66.5533 11.8492 1.2148 20.6324 23.6103 0.5985 7.4283 2.6698 54.0793 0.4425 3.4444 64.3971 2.7461 63.8067 14.8150 0.2476 70.5214 15.6081 3.1216 17.3008 15.9644 566.2312 21.3695 3.5505 17.1591 76.1446 12.5423 49.6067 1.4236 30.4169 95.0864 20.4112 27.8042 26.5270 13.2801 52.3477 86.8442 98.0435 14.9963 53.6952 97.7532 97.4124 11.0820 61.0304 221.6134 83.8093 133.5666 275.3660 509.2556 40.0569 6.2010 18.9023 5.2210 9.7539 18.9173 5.9196 15.2773 7.1300 7.9799
temp: 298.150 k
press: 1.00000 atm
elementType: 8 8 8 8 7 7 6 6 6 6 6 6 6 6 6 6 6 6 6 6 1 1 1 1 1 1 1 1 1 1 1 1 1 1
symmnumber: 1
zpe: 680515.1 jmol-1
zpe.correction: 0.259195 hartree
zpe.thermalcorrener: 0.276851 hartree
zpe.thermalcorrenthalpy: 0.277795 hartree
zpe.thermalcorrgfe: 0.211899 hartree
zpe.sumelectzpe: -950.742454 hartree
zpe.sumelectthermal: -950.724798 hartree
zpe.sumelectthermalent: -950.723854 hartree
zpe.sumelectthermalfe: -950.789750 hartree
dipole: 0.1147 -2.5091 2.8534
dipole: 3.8014
quadrupole: -60.0770 -133.6385 -117.2399
quadrupole: -5.0897 2.6372 2.7203
quadrupole: 43.5747 -29.9867 -13.5881 -5.0897 2.6372 2.7203
hfenergy: -951.0016487 hartree
pointgroup: C01 [X(C14H14N2O4)]
dipole: 0.0356298 -0.9943157 1.1166299 debye
polarizability: 280.5571466|-20.4830711|199.7643203|14.6924062|12.8487621|100.3663817 unknown
InChI: InChI=1S/C14H14N2O4/c1-20-11-5-6-13(16(18)19)12(9-11)14(17)8-10-4-2-3-7-15-10/h2-7,9,14,17H,8H2,1H3
charge 0 multiplicity 1
34 atoms
O  -0.481167 -1.566295 -1.115407
O  4.038972 -2.146333 0.223006
O  1.658933 3.716781 -0.342416
O  -0.30517 2.570398 -0.373799
N  0.991799 2.606184 -0.298752
N  -3.038794 -1.315797 -0.391649
C  -0.354584 -0.210555 -0.588593
C  1.123812 0.053359 -0.295595
C  -1.218466 -0.079184 0.711588
C  1.735015 1.343457 -0.155853
C  1.961377 -1.070322 -0.169405
C  -2.698688 -0.263218 0.428722
C  3.343499 -0.945337 0.111125
C  3.12094 1.471505 0.111072
C  3.934357 0.339364 0.255324
C  -3.691376 0.589109 0.970866
C  -5.051777 0.341443 0.683237
C  -4.351293 -1.54361 -0.673116
C  -5.393948 -0.747764 -0.150486
C  5.482197 -2.089363 0.492256
H  -0.722635 0.530346 -1.325756
H  -1.050821 0.897971 1.189547
H  -0.876362 -0.873506 1.405051
H  1.51906 -2.057288 -0.323261
H  3.537507 2.47826 0.197168
H  4.999519 0.462587 0.46776
H  -1.475107 -1.78771 -1.029576
H  -3.393039 1.43482 1.597773
H  -5.830791 0.990762 1.096579
H  -4.562567 -2.389007 -1.336714
H  -6.435705 -0.972994 -0.397013
H  5.688566 -1.595311 1.460662
H  6.018786 -1.564727 -0.32075
H  5.804358 -3.139424 0.534006
