program: Gaussian 09
title: 000261475
version: EM64L-G09RevD.01
frameworkgroup: C1[X(C12H17NO)]
method: RPBEPBE
basis: SDD
operation: Freq
keyword: #p
keyword: freq=noraman
keyword: PBEPBE/SDD
title: #p freq=noraman PBEPBE/SDD
converged: NO YES NO NO
title: Mulliken charges:
elementType: O N C C C C C C C C C C C C H H H H H H H H H H H H H H H H H
charge: -0.299508 -0.023744 -0.452988 -0.111070 -0.386808 -0.385565 -0.344522 0.438572 -0.615210 -0.395503 -0.433672 -0.224284 -0.227103 -0.244637 0.225476 0.206786 0.228321 0.212942 0.199831 0.203348 0.198638 0.208755 0.192706 0.206342 0.216459 0.248716 0.258879 0.228990 0.221930 0.222571 0.225352
chargesum: 0.00000
title: Mulliken charges with hydrogens summed into heavy atoms:
elementType: O N C C C C C C C C C C C C
charge: -0.299508 -0.023744 -0.020727 0.117251 0.025966 0.016421 0.056939 0.438572 0.056308 -0.136624 -0.204682 -0.002354 -0.004532 -0.019285
polarizability: 1.81235398e+02 1.00310469e+00 1.14411172e+02 -4.10699984e-01 1.27934267e+01 1.14925800e+02
1716.lowfreq: -22.2421 -6.3742 0.0007 0.0008 0.0009 7.5393 17.0176 48.1005 78.9477
frequency: -15.3757 48.0734 78.9064 135.3561 158.7616 194.7594 220.9439 244.7352 287.4404 311.7855 324.8927 353.3765 399.6650 400.3636 458.0764 503.1305 516.1390 549.8363 611.3744 618.7448 703.3381 721.2041 747.7133 763.5243 798.9796 850.2271 852.5615 866.8170 907.6816 915.9655 951.5996 960.8857 974.2599 982.7772 989.7349 992.9638 1027.0649 1047.1228 1055.3017 1079.1174 1095.3662 1108.1288 1134.6915 1170.6414 1173.8427 1185.1845 1188.8713 1208.5872 1217.2122 1243.0090 1270.0906 1294.7682 1303.9748 1324.6611 1339.7445 1342.9722 1352.9570 1361.9810 1384.0064 1412.4188 1437.4212 1439.1112 1450.8688 1458.1490 1463.4373 1469.1614 1478.5386 1482.3833 1592.5235 1614.0987 2902.5328 2931.0460 2972.0075 2978.0154 2986.1000 3004.0915 3012.8860 3030.2351 3036.0475 3050.2297 3051.3460 3111.7131 3112.9270 3123.7004 3137.1905 3152.3121 3164.0382
redmass: 3.5987 3.0009 3.8985 3.0281 2.0624 3.7650 1.1899 3.7064 2.6215 2.5504 2.7521 4.0873 2.9164 2.8273 2.9137 1.9339 3.6260 3.3229 5.4132 5.8628 1.7414 2.6568 2.2920 1.8723 2.8923 1.9770 1.3297 3.4210 2.5343 1.5645 2.1572 1.8733 1.3919 3.0246 6.2446 1.3570 2.1380 2.3764 2.4021 1.7479 1.9157 1.5910 1.9399 1.0570 1.6485 1.1184 1.8571 2.1073 1.2478 1.2907 1.2238 1.4065 1.1840 1.2787 1.4372 1.3777 1.4077 1.3819 6.7049 1.1654 2.1525 1.0767 1.0585 1.0788 1.0859 1.0945 1.0509 2.3179 6.1320 6.1195 1.0663 1.0463 1.0602 1.0612 1.0642 1.0848 1.0914 1.0985 1.1015 1.0976 1.0897 1.0998 1.0867 1.0866 1.0925 1.0956 1.1004
irintensity: 0.1994 0.1284 0.9993 2.3211 1.2655 0.9124 0.2161 0.8723 3.3421 5.7107 1.4086 0.7167 0.7796 0.8477 1.1947 1.1007 4.8109 17.3672 3.0955 2.9542 54.6166 12.0760 20.5392 37.4669 9.8845 4.0011 0.3787 11.7171 53.2272 0.5485 5.4918 1.9864 0.6727 40.4496 0.3812 1.3797 5.7000 15.9066 14.6686 5.3833 7.3663 0.6782 2.0536 0.2233 4.0250 1.1258 2.5639 4.2650 4.4446 0.5531 2.2830 1.8311 4.0201 4.9591 5.3632 0.0439 2.5972 2.6241 0.2534 3.5963 8.6143 11.6291 8.0240 8.8547 13.3304 9.4599 10.3336 14.8063 1.3576 7.9255 61.7617 95.5588 16.3625 30.3628 49.8247 10.9025 40.9270 21.9673 39.4302 31.0254 75.2441 20.6612 8.9353 0.4969 31.2459 34.7899 16.4441
temp: 298.150 k
press: 1.00000 atm
elementType: 8 7 6 6 6 6 6 6 6 6 6 6 6 6 1 1 1 1 1 1 1 1 1 1 1 1 1 1 1 1 1
symmnumber: 1
zpe: 695989.9 jmol-1
zpe.correction: 0.265089 hartree
zpe.thermalcorrener: 0.277294 hartree
zpe.thermalcorrenthalpy: 0.278239 hartree
zpe.thermalcorrgfe: 0.226884 hartree
zpe.sumelectzpe: -596.320566 hartree
zpe.sumelectthermal: -596.308360 hartree
zpe.sumelectthermalent: -596.307416 hartree
zpe.sumelectthermalfe: -596.358770 hartree
dipole: -1.4883 -0.4616 -0.1640
dipole: 1.5669
quadrupole: -74.0947 -82.6630 -82.7970
quadrupole: -0.8556 -0.4487 3.0383
quadrupole: 5.7569 -2.8114 -2.9455 -0.8556 -0.4487 3.0383
hfenergy: -596.5856542 hartree
pointgroup: C01 [X(C12H17N1O1)]
dipole: 0.5898755 0.1645647 -0.0705687 debye
polarizability: 181.2442715|-0.5632867|113.2775526|0.2714054|-12.7282669|116.0505454 unknown
InChI: InChI=1S/C12H17NO/c1-13-10-6-5-9-12(14-13)11-7-3-2-4-8-11/h2-4,7-8,12H,5-6,9-10H2,1H3
charge 0 multiplicity 1
31 atoms
O  1.02621 -0.72625 0.403589
N  2.200279 -1.16112 -0.467725
C  0.740343 1.750522 0.216367
C  0.30211 0.351641 -0.316782
C  2.217134 1.819508 0.683819
C  3.255986 1.124304 -0.23527
C  3.392423 -0.39442 0.000456
C  -1.196092 0.129913 -0.164291
C  2.324059 -2.61337 -0.191649
C  -1.732332 -0.454288 1.01114
C  -2.081611 0.554919 -1.185643
C  -3.128639 -0.607194 1.160297
C  -3.479538 0.407819 -1.035041
C  -4.008175 -0.17294 0.140455
H  0.089892 2.041929 1.063385
H  0.558005 2.490792 -0.588468
H  0.591743 0.256394 -1.380736
H  2.29416 1.371411 1.692927
H  2.486206 2.889079 0.792774
H  3.021579 1.309291 -1.302404
H  4.251862 1.572406 -0.046401
H  4.248227 -0.78623 -0.585751
H  3.597325 -0.587523 1.080422
H  2.530936 -2.837409 0.878254
H  3.14961 -3.010227 -0.809887
H  1.385917 -3.108381 -0.485973
H  -1.04867 -0.803891 1.791543
H  -1.677544 0.99621 -2.10563
H  -3.531942 -1.066424 2.070302
H  -4.152541 0.738183 -1.834574
H  -5.091323 -0.291055 0.258194
