program: Gaussian 09
title: 000261433
version: EM64L-G09RevD.01
frameworkgroup: C1[X(C19H18IN7O6)]
method: RPBEPBE
basis: SDD
operation: Freq
keyword: #p
keyword: freq=noraman
keyword: PBEPBE/SDD
title: #p freq=noraman PBEPBE/SDD
converged: YES YES NO NO
title: Mulliken charges:
elementType: I O O O O O O N N N N N N N C C C C C C C C C C C C C C C C C C C H H H H H H H H H H H H H H H H H H
charge: 0.082536 -0.397657 -0.287556 -0.241586 -0.417695 -0.224819 -0.190434 -0.456512 -0.397265 0.078071 -0.412503 -0.020122 -0.034842 -0.612101 -0.135397 -0.390829 -0.484283 0.154629 0.295688 0.114260 0.657958 -0.529599 -0.312383 -0.360097 -0.606024 -0.359636 0.174123 0.181037 -0.177310 0.171026 -0.375623 0.002259 0.155091 0.310489 0.284686 0.251205 0.269720 0.256246 0.344912 0.261259 0.261863 0.292219 0.213092 0.292951 0.259396 0.279518 0.390396 0.328166 0.378955 0.362497 0.320026
chargesum: 0.00000
title: Mulliken charges with hydrogens summed into heavy atoms:
elementType: I O O O O O O N N N N N N N C C C C C C C C C C C C C C C C C C C
charge: 0.082536 -0.007261 -0.287556 -0.241586 -0.038740 -0.224819 -0.190434 -0.111601 -0.104314 0.078071 -0.084337 -0.020122 -0.034842 0.070422 0.175093 0.145062 0.041684 0.154629 0.295688 0.114260 0.657958 -0.006477 -0.020163 -0.147004 -0.606024 -0.100240 0.174123 0.181037 -0.177310 0.171026 -0.096105 0.002259 0.155091
polarizability: 3.75161766e+02 3.18406753e+01 3.47113429e+02 -1.98299422e+01 -5.25584177e-01 2.42742214e+02
1716.lowfreq: -2.9128 -1.4939 0.0004 0.0005 0.0008 4.5862 7.1877 12.1394 13.6419
frequency: 5.5648 11.8695 13.4990 16.9064 18.3465 25.7356 36.9215 43.5185 51.8943 59.0127 75.2818 86.7444 90.6158 95.9791 112.9079 130.7130 143.4686 147.3173 152.8315 174.5900 184.6327 198.5697 204.6465 241.8009 250.2041 289.8425 298.3275 308.4766 313.5343 320.4189 331.2537 365.5808 366.9815 417.2287 426.2765 440.0882 441.3396 459.3166 465.6494 470.9405 483.3775 504.2165 533.4515 536.0075 544.3492 548.8163 555.6490 561.5399 588.7267 591.9322 592.3001 606.0841 625.2833 631.6367 636.5491 640.0337 643.2915 652.7043 697.9111 699.1762 709.1218 722.2458 725.1449 747.0671 767.3907 780.0421 813.3181 815.7554 816.6337 828.9433 878.1276 900.6525 906.5639 924.2477 935.2411 938.6014 947.4700 971.5275 993.3242 1011.7798 1016.6149 1027.0542 1046.8594 1061.4123 1096.6419 1100.4342 1110.0618 1118.6877 1155.3799 1169.9136 1181.9643 1184.4365 1218.6128 1232.8800 1235.4033 1241.9917 1251.1785 1260.0024 1269.3804 1272.7802 1284.3441 1290.3000 1305.2602 1328.7779 1334.5842 1354.6060 1355.0905 1360.4417 1375.2599 1380.0713 1414.8927 1438.4874 1440.5378 1446.3136 1455.2352 1468.3886 1468.7395 1484.1239 1513.8904 1526.0133 1537.3006 1544.2900 1582.3488 1590.2930 1599.2284 1616.0523 1644.1042 1644.9433 1670.1488 2988.7581 2990.9444 2999.9226 3035.9457 3041.7373 3046.9527 3101.4685 3129.4442 3162.3858 3165.0300 3167.5395 3507.9264 3512.6759 3514.6732 3518.7033 3520.8455 3548.1726 3699.7456
redmass: 9.1740 8.6441 9.7238 10.7590 8.8537 8.6400 7.1735 9.0738 8.8399 7.0467 5.5460 6.6872 4.0923 4.5933 8.2094 8.2487 5.4014 5.3130 5.4410 6.8256 7.2317 4.4021 4.8562 5.9109 5.8291 4.0791 5.7374 1.2115 5.0361 3.9827 5.5283 5.3711 4.6301 5.2046 4.9851 7.0493 3.7197 4.3476 3.9138 8.3561 1.2018 1.7979 3.5503 4.2879 2.6619 2.8997 1.5829 2.7785 4.3903 5.2619 1.3975 5.1097 2.2819 1.8081 1.3592 1.6887 6.9806 6.8064 9.2298 4.6698 6.5782 5.7067 4.5864 4.0407 2.5830 2.3548 6.6408 1.9249 5.1664 4.5611 4.2841 4.5148 5.3327 1.3983 2.2020 1.6956 1.3668 3.7659 2.4763 2.7545 2.5372 2.7161 2.6998 2.1368 2.5676 3.3353 2.7592 3.5692 1.8055 1.5203 3.7768 1.5747 1.4113 1.4346 1.9367 1.4820 1.8391 3.8764 1.6113 1.7813 1.3135 1.7961 2.7749 1.8499 1.5138 2.3531 2.4778 2.8777 2.2034 1.7841 4.5823 4.5620 1.1406 1.8872 2.6405 1.2956 1.1869 2.0425 8.7168 3.7341 4.3535 3.7941 6.8981 2.9905 2.4407 6.3221 2.8330 8.3750 8.2686 1.0623 1.0609 1.0816 1.0625 1.0967 1.0995 1.1038 1.0884 1.0929 1.0935 1.0928 1.0778 1.0772 1.0640 1.0660 1.0753 1.0456 1.1054
irintensity: 1.5782 2.7021 1.7332 4.5587 0.5432 0.9036 2.5103 2.0459 0.5410 1.4986 2.1272 1.2477 0.7853 1.1391 1.7882 1.5522 2.4820 0.0817 3.2054 8.4454 0.9495 1.4623 10.3315 11.6890 0.9236 2.0194 2.8720 56.2366 4.4270 3.8405 0.3904 4.5777 0.7053 36.1375 14.7201 5.8956 15.5870 5.2736 11.6352 3.4756 96.6688 36.2003 142.4799 2.9847 87.7989 30.9453 112.2836 104.2297 18.9312 7.0962 10.4901 4.8346 11.2423 82.2829 113.6533 115.4964 5.6823 52.6029 20.4004 20.7117 1.7213 1.1586 13.6370 31.3641 25.0634 26.2858 3.3364 37.5795 11.0259 11.4920 7.6059 9.1147 9.9706 14.0441 14.1120 1.4561 9.9731 5.3661 3.1784 61.2983 44.8420 109.3337 255.3979 167.7556 23.7248 48.5915 10.8570 25.1179 8.3491 1.2162 49.5710 2.6261 8.7533 146.7093 7.7710 11.6215 56.6337 20.6529 30.1533 7.6288 64.6336 14.1520 31.8986 9.8787 53.7526 197.0333 199.3185 308.5866 92.5837 74.5866 7.0051 141.8093 27.8760 68.6135 119.3467 4.9147 33.2164 600.5039 84.2802 195.8406 68.2451 4.8033 133.8006 418.0834 264.4555 340.4183 458.8142 162.4025 213.7355 23.0000 9.7849 17.4625 9.0602 5.8759 5.4243 9.6874 17.0112 4.4862 12.2927 7.9316 33.2747 79.4361 23.2401 71.8668 19.4146 158.3822 49.5118
temp: 298.150 k
press: 1.00000 atm
elementType: 53 8 8 8 8 8 8 7 7 7 7 7 7 7 6 6 6 6 6 6 6 6 6 6 6 6 6 6 6 6 6 6 6 1 1 1 1 1 1 1 1 1 1 1 1 1 1 1 1 1 1
symmnumber: 1
zpe: 966903.8 jmol-1
zpe.correction: 0.368274 hartree
zpe.thermalcorrener: 0.399853 hartree
zpe.thermalcorrenthalpy: 0.400797 hartree
zpe.thermalcorrgfe: 0.296299 hartree
zpe.sumelectzpe: -1578.612083 hartree
zpe.sumelectthermal: -1578.580504 hartree
zpe.sumelectthermalent: -1578.579560 hartree
zpe.sumelectthermalfe: -1578.684058 hartree
dipole: -4.0320 -2.6094 -6.0645
dipole: 7.7359
quadrupole: -200.9701 -188.8629 -204.3282
quadrupole: -24.0314 54.0394 35.6482
quadrupole: -2.9164 9.1909 -6.2745 -24.0314 54.0394 35.6482
hfenergy: -1578.9803568 hartree
pointgroup: C01 [X(C19H18I1N7O6)]
dipole: -1.5920458 -2.4267282 0.9162362 debye
polarizability: 375.4953698|-18.4892229|242.8976605|-32.5013164|-3.9779844|346.6243785 unknown
InChI: InChI=1S/C19H18IN7O6/c20-10-5-8(16(30)25-12(18(32)33)3-4-13(28)29)1-2-11(10)22-6-9-7-23-15-14(24-9)17(31)27-19(21)26-15/h1-2,5,7,12,22,25-26,28,32H,3-4,6,21H2
charge 0 multiplicity 1
51 atoms
I  0.061173 -0.150267 -5.407502
O  5.810791 -2.475394 2.819224
O  4.217719 -1.286802 -1.857508
O  3.679716 -1.568272 2.980639
O  6.916452 3.007883 1.841211
O  8.10664 1.601109 0.427963
O  -5.764267 2.54405 2.017288
N  3.638507 -0.886252 0.34732
N  -1.718195 1.102236 -2.910097
N  -4.221016 1.464736 -0.173499
N  -5.834996 -1.508461 1.267502
N  -4.355737 -1.355953 -0.560527
N  -6.547247 0.404311 2.556501
N  -7.319895 -1.729154 3.094488
C  4.90492 -1.441974 0.8361
C  6.118947 -0.480824 0.64952
C  5.938581 0.86066 1.37956
C  3.360842 -0.863191 -1.012021
C  2.025064 -0.327799 -1.430985
C  4.701875 -1.818728 2.29892
C  -0.501111 0.637394 -2.427957
C  -2.722789 1.773356 -2.09009
C  1.702012 -0.425774 -2.810947
C  1.075007 0.265625 -0.56065
C  0.474805 0.040892 -3.291439
C  -0.157003 0.735254 -1.042774
C  -3.530249 0.850554 -1.176597
C  7.099358 1.805145 1.138642
C  -4.989546 0.691371 0.643404
C  -5.045603 -0.721553 0.429189
C  -3.597175 -0.558646 -1.361322
C  -5.781461 1.309316 1.777733
C  -6.557807 -0.899725 2.30329
H  5.141192 -2.360016 0.261895
H  6.235757 -0.314992 -0.434429
H  7.029751 -0.993858 1.003403
H  5.012493 1.36822 1.047476
H  5.83612 0.730362 2.474941
H  2.924877 -0.690791 1.054338
H  -3.4290 2.289267 -2.766726
H  -2.275481 2.567318 -1.460823
H  2.448968 -0.874501 -3.47269
H  1.280043 0.388769 0.509138
H  -1.870121 1.046209 -3.9194
H  -0.86675 1.18829 -0.344785
H  -3.030116 -1.050836 -2.155726
H  5.651169 -2.703813 3.77494
H  -5.844828 -2.516123 1.084919
H  7.687608 3.611637 1.660904
H  -7.841514 -1.279785 3.844274
H  -7.381677 -2.735675 2.965371
