program: Gaussian 09
title: 000261332
version: EM64L-G09RevD.01
frameworkgroup: C1[X(C23H24N2S)]
method: RPBEPBE
basis: SDD
operation: Freq
keyword: #p
keyword: freq=noraman
keyword: PBEPBE/SDD
title: #p freq=noraman PBEPBE/SDD
converged: YES YES NO NO
title: Mulliken charges:
elementType: S N N C C C C C C C C C C C C C C C C C C C C C C C H H H H H H H H H H H H H H H H H H H H H H H H
charge: -0.038263 -0.181749 -0.018463 -0.397064 -0.419433 -0.396652 -0.378715 0.452002 -0.307001 -0.529056 0.330442 -0.556373 -0.388156 0.174278 0.480770 -0.375983 0.393666 -0.223235 -0.424904 -0.386371 -0.257805 -0.463482 -0.816164 -0.426313 -0.262019 -0.244340 0.217281 0.232747 0.215968 0.237264 0.246809 0.251032 0.251481 0.260363 0.206065 0.289596 0.230520 0.235124 0.260239 0.217241 0.230258 0.230823 0.240229 0.229737 0.220524 0.234137 0.224163 0.239276 0.228641 0.230868
chargesum: 0.00000
title: Mulliken charges with hydrogens summed into heavy atoms:
elementType: S N N C C C C C C C C C C C C C C C C C C C C C C C
charge: -0.038263 -0.181749 -0.018463 0.052965 0.033799 0.101189 0.133130 0.452002 -0.307001 -0.033395 0.330442 -0.325853 -0.153033 0.174278 0.480770 -0.115744 0.393666 -0.005994 -0.194647 -0.155548 -0.028069 -0.223254 -0.137341 -0.187037 -0.033378 -0.013471
polarizability: 3.26876495e+02 -1.19554300e+01 2.82146043e+02 -2.83861014e+01 2.50881366e+01 2.48085073e+02
1716.lowfreq: -6.4976 0.0010 0.0013 0.0014 1.6386 4.8255 9.6669 14.1457 32.7806
frequency: 7.1466 14.0400 32.7661 39.6845 49.7072 58.6006 84.5150 98.5695 104.0813 121.6263 166.4194 171.9737 178.8682 206.4205 212.6499 216.6791 241.2289 259.5981 276.9456 322.7756 328.1499 362.2335 409.6734 413.1689 427.6142 440.3256 456.9300 470.2199 471.5573 494.2074 504.9638 516.3866 525.8250 538.0091 551.2112 569.8690 601.6399 621.4434 636.8622 686.3589 693.5117 696.7447 731.7046 746.2007 773.7623 784.3150 788.7108 810.5015 824.5071 840.4910 844.4553 852.9831 857.1918 865.2151 875.2877 918.6804 947.2253 953.7767 960.1845 963.2932 967.7899 981.0061 985.9100 993.7346 1005.5931 1007.8213 1029.6777 1032.4050 1045.0796 1060.1521 1071.9139 1075.5762 1081.1468 1101.7071 1127.6043 1151.3605 1169.4808 1175.3315 1181.1671 1185.8917 1190.0919 1200.0908 1206.8550 1222.2773 1235.2243 1245.7073 1251.8844 1256.6844 1269.2414 1280.7718 1295.4053 1316.2166 1338.3731 1350.4456 1355.3203 1365.0883 1376.9171 1380.7630 1389.2049 1396.0870 1404.2620 1416.2710 1434.2713 1440.2877 1443.5737 1450.7530 1459.2215 1470.9713 1472.5384 1474.4337 1477.3912 1488.1491 1490.1763 1499.7319 1518.1889 1587.5617 1589.3336 1598.7470 1621.8291 1631.7897 2919.2614 2927.1336 2974.0071 2979.5149 2986.9150 2989.5533 3012.2829 3033.8517 3045.1787 3049.4435 3055.0900 3082.3898 3094.7107 3119.7676 3121.5253 3122.7714 3131.9373 3132.4881 3134.5629 3141.0939 3148.4163 3156.0136 3160.6646 3164.1834
redmass: 5.6258 4.8385 3.8627 4.9921 5.2325 1.0251 3.9766 4.4710 3.7639 3.8053 4.4010 4.4528 4.2472 4.6214 3.8241 3.3568 3.9678 3.2326 2.0734 2.6655 3.1444 2.8569 2.9209 3.6965 4.8866 2.8651 3.5408 3.7013 3.6675 3.9736 6.5008 4.4278 4.2227 3.9188 5.0296 3.4717 2.5454 3.7586 3.5092 3.9168 2.2926 3.5379 2.6795 1.5449 1.5480 3.5609 2.8180 1.4370 4.1613 3.2114 1.4521 1.4982 2.9586 1.5235 1.8388 1.5556 1.9802 2.1437 1.5270 1.4059 2.0798 3.4638 1.3736 1.3612 1.8667 4.2756 2.1716 2.2944 1.5506 1.8418 2.1028 2.1847 2.2091 1.6279 2.9592 1.4531 1.7966 1.2181 1.2919 1.2813 1.3337 1.5774 1.4445 1.2974 1.8934 1.8952 1.7570 1.4942 1.7408 1.5207 1.6766 1.3799 1.2930 1.6571 1.4480 1.5881 2.1558 1.9981 3.8068 1.2501 2.8190 5.2780 3.6657 2.4192 2.3118 1.4862 1.5682 1.0924 1.1458 1.1855 1.2993 1.2301 1.1202 1.7668 3.7350 5.8373 7.4527 5.1980 6.0297 6.5275 1.0699 1.0691 1.0382 1.0645 1.0629 1.0680 1.0926 1.0899 1.1022 1.0939 1.0953 1.0996 1.0945 1.0857 1.0864 1.0858 1.0902 1.0895 1.0900 1.0928 1.0942 1.0992 1.0969 1.1003
irintensity: 0.0820 0.5348 0.0870 0.3687 3.5974 0.4327 0.1294 1.1966 0.8302 1.2820 2.9429 6.0884 1.8895 3.2326 3.6409 1.1022 1.3277 2.2918 2.1468 1.3065 4.7509 1.3749 5.5420 6.3490 4.6564 6.1075 1.0571 0.2145 0.3040 2.9415 0.1419 2.4935 6.2244 4.5172 2.0270 0.4595 1.7194 2.3020 1.4225 0.2837 15.5478 9.6772 1.3639 6.6769 59.2530 13.8370 36.1945 82.6510 1.8831 1.1082 11.5739 0.3869 6.5920 5.1560 2.9253 2.4374 1.4460 3.9111 1.8071 0.3451 27.2445 22.2927 0.3231 0.2235 50.6612 1.2225 12.1847 4.6113 17.0774 3.8213 5.4432 1.5233 5.8945 5.6604 44.8905 1.0180 28.6045 4.1563 4.8531 13.4269 45.3381 30.5136 7.2355 19.9454 2.5918 7.7970 21.5910 10.1197 14.7758 40.1858 35.2137 5.2193 0.9618 5.1512 3.9183 22.9091 18.7771 126.3909 10.9586 10.1210 6.0138 4.0782 345.0591 32.4253 13.7913 13.0015 6.5570 19.5028 7.9054 24.1050 9.8453 104.0771 8.1338 67.6669 8.2128 34.6396 3.3424 7.9994 277.2953 0.4782 81.2200 41.9006 39.9952 17.5839 21.2673 5.7625 35.4522 22.3260 13.7093 5.4497 23.7989 21.1766 12.8313 5.2370 1.4030 0.9540 6.0727 10.9135 29.6995 28.6437 37.0562 29.9901 16.4746 25.4713
temp: 298.150 k
press: 1.00000 atm
elementType: 16 7 7 6 6 6 6 6 6 6 6 6 6 6 6 6 6 6 6 6 6 6 6 6 6 6 1 1 1 1 1 1 1 1 1 1 1 1 1 1 1 1 1 1 1 1 1 1 1 1
symmnumber: 1
zpe: 1080377.0 jmol-1
zpe.correction: 0.411494 hartree
zpe.thermalcorrener: 0.434710 hartree
zpe.thermalcorrenthalpy: 0.435654 hartree
zpe.thermalcorrgfe: 0.355145 hartree
zpe.sumelectzpe: -1396.567563 hartree
zpe.sumelectthermal: -1396.544347 hartree
zpe.sumelectthermalent: -1396.543403 hartree
zpe.sumelectthermalfe: -1396.623912 hartree
dipole: -0.3820 -3.8851 0.4585
dipole: 3.9307
quadrupole: -160.5401 -177.5157 -148.8184
quadrupole: -17.1358 -5.2044 6.7389
quadrupole: 1.7513 -15.2243 13.4730 -17.1358 -5.2044 6.7389
hfenergy: -1396.9790567 hartree
pointgroup: C01 [X(C23H24N2S1)]
dipole: -0.2273592 -1.4623582 -0.4487198 debye
polarizability: 313.4001504|7.2048055|256.8224032|-38.7261899|28.0479958|286.8850575 unknown
InChI: InChI=1S/C23H24N2S/c1-18-6-4-10-21(16-18)24-12-14-25(15-13-24)23(26)17-20-9-5-8-19-7-2-3-11-22(19)20/h2-11,16H,12-15,17H2,1H3
charge 0 multiplicity 1
50 atoms
S  1.41854 3.959509 0.924473
N  -2.573349 0.406406 0.227291
N  0.049406 1.71678 0.224111
C  -1.664967 0.32153 -0.928186
C  -2.047597 1.070661 1.431588
C  -0.197316 0.428422 -0.473412
C  -1.070933 2.203531 1.071834
C  -3.847357 -0.186911 0.196067
C  1.207447 2.448224 0.124435
C  2.335485 1.877394 -0.734281
C  2.970368 0.587818 -0.199727
C  -4.598414 -0.3934 1.394298
C  -4.42691 -0.6060 -1.040971
C  3.655302 -0.322897 -1.092345
C  -5.884133 -0.981133 1.372125
C  2.93557 0.303708 1.171698
C  4.259988 -1.525699 -0.544541
C  -5.702487 -1.203957 -1.057916
C  -6.43748 -1.39451 0.132775
C  3.778939 -0.092301 -2.505726
C  3.542388 -0.872922 1.707824
C  4.186311 -1.77766 0.864674
C  -6.667391 -1.157326 2.663537
C  4.930953 -2.440468 -1.422596
C  4.442135 -1.000403 -3.335499
C  5.020745 -2.189685 -2.792482
H  -1.878345 1.107838 -1.685846
H  -1.790829 -0.659217 -1.426785
H  -1.553745 0.350487 2.122044
H  -2.883617 1.531471 1.988469
H  0.051207 -0.416693 0.198102
H  0.457162 0.348029 -1.354314
H  -1.599055 3.020701 0.54247
H  -0.640474 2.650625 1.986374
H  1.962537 1.726056 -1.767004
H  3.104439 2.667049 -0.797867
H  -4.169036 -0.121858 2.364887
H  -3.900806 -0.442685 -1.986456
H  2.441445 1.008102 1.850486
H  -6.13023 -1.517148 -2.017673
H  -7.429261 -1.859864 0.104038
H  3.364353 0.819721 -2.946932
H  4.64942 -2.686452 1.266877
H  3.49776 -1.057108 2.786772
H  -6.000657 -1.2062 3.542543
H  -7.363728 -0.311047 2.823608
H  -7.274246 -2.080073 2.643395
H  5.379108 -3.345063 -0.994069
H  4.525851 -0.799428 -4.409287
H  5.537205 -2.894652 -3.452882
